{"text_format":"1","workbook":"xlsx","n_sheets":35,"sheets":["START","Instructions","Template names","Lookup and lists","Org structure","Contacts","C1-Sum","C2-FinPerf SC","C2C","C3-FinPerf V","C3C","C4-FinPerf RE","C5-Capex","C5C","C6-FinPos","C7-CFlow","SC1","SC2","SC3","SC4","SC5","SC6","SC7(1)","SC7(2)","SC8","SC9","SC10","SC11","SC12","SC13a","SC13b","SC13c","SC13d","SC13e","SC71charts"],"not_rendered":{"charts":5,"images":16,"macros":1,"external_links":1,"defined_names":225,"comments":0,"pivot_tables":0},"unopened":[],"bounds":{"document_bytes":16777216,"sheet_cells":100000,"rows_first":2000,"rows_last":500,"rows_between":2000,"halvings":0,"cell_chars":16384,"cell_head_chars":4096},"cells_cut":0,"cells_raw":0,"read":"whole","date_system":"1900"}

{"sheet":"START","index":0,"n_rows":1,"n_cols":1,"rows_kept":1,"cut":false,"hidden":false,"merged":[]}
[{"$f":"muni","v":"Choose name from list"}]

{"sheet":"Instructions","index":1,"n_rows":55,"n_cols":25,"rows_kept":55,"cut":false,"hidden":false,"merged":[]}
[]
[null,null,null,2020]
[]
[null,null,null,null,null,null,null,null,null,null,null,null,null,null,null,null,null,null,null,null,null,null,null,"Yes"]
[null,null,null,null,null,null,null,null,null,null,null,null,null,null,null,null,null,null,null,null,null,null,null,"No"]
[]
[null,null,null,null,null,null,null,null,null,null,null,null,null,null,null,null,null,null,null,null,null,null,"Type of Entities Range:","Parent Municipality"]
[null,null,null,null,null,null,null,null,null,null,null,null,null,null,null,null,null,null,null,null,null,null,null,"Consolidated Information"]
[]
[null,null,null,null,null,null,null,null,null,null,null,null,null,null,null,null,null,null,null,null,null,null,"Date linked",11]
[null,null,null,null,null,null,null,null,null,null,null,null,null,null,null,null,null,null,null,null,null,null,"Date",{"$f":"VLOOKUP(X10,W39:X55,2)","v":"M11 May"},"2013-08-01"]
[]
[]
[]
[]
[]
[]
[]
[null,null,null,null,null,null,null,null,null,null,null,null,null,null,null,null,null,null,null,null,null,null,"MTREF Range:",2014]
[null,null,null,null,null,null,null,null,null,null,null,null,null,null,null,null,null,null,null,null,null,null,null,2015]
[null,null,null,null,null,null,null,null,null,null,null,null,null,null,null,null,null,null,null,null,null,null,null,2016]
[null,null,null,null,null,null,null,null,null,null,null,null,null,null,null,null,null,null,null,null,null,null,null,2017]
[null,null,null,null,null,null,null,null,null,null,null,null,null,null,null,null,null,null,null,null,null,null,null,2018]
[null,null,null,null,null,null,null,null,null,null,null,null,null,null,null,null,null,null,null,null,null,null,null,2019]
[null,null,null,null,null,null,null,null,null,null,null,null,null,null,null,null,null,null,null,null,null,null,null,2020]
[null,null,null,null,null,null,null,null,null,null,null,null,null,null,null,null,null,null,null,null,null,null,null,2021]
[null,null,null,null,null,null,null,null,null,null,null,null,null,null,null,null,null,null,null,null,null,null,null,2022]
[null,null,null,null,null,null,null,null,null,null,null,null,null,null,null,null,null,null,null,null,null,null,null,2023]
[null,null,null,null,null,null,null,null,null,null,null,null,null,null,null,null,null,null,null,null,null,null,null,2024]
[null,null,null,null,null,null,null,null,null,null,null,null,null,null,null,null,null,null,null,null,null,null,null,2025]
[null,null,null,null,null,null,null,null,null,null,null,null,null,null,null,null,null,null,null,null,null,null,null,2026]
[null,null,null,null,null,null,null,null,null,null,null,null,null,null,null,null,null,null,null,null,null,null,null,2027]
[null,null,null,null,null,null,null,null,null,null,null,null,null,null,null,null,null,null,null,null,null,null,null,2028]
[null,null,null,null,null,null,null,null,null,null,null,null,null,null,null,null,null,null,null,null,null,null,"MTREF Linked:"]
[null,null,null,null,null,null,null,null,null,null,null,null,null,null,null,null,null,null,null,null,null,null,"MTREF:",10]
[null,null,null,null,null,null,null,null,null,null,null,null,null,null,null,null,null,null,null,null,null,null,null,{"$f":"INDEX(X19:X32,X35,1)","v":2023}]
[null,null,null,null,null,null,null,null,null,null,null,null,null,null,null,null,null,null,null,null,null,null,"Fin Year:"]
[null,null,null,null,null,null,null,null,null,null,null,null,null,null,null,null,null,null,null,null,null,null,null,{"$f":"MTREF&\"/\"&RIGHT(MTREF,2)+1","v":"2023/24"}]
[null,null,null,null,null,null,null,null,null,null,null,null,null,null,null,null,null,null,null,null,null,"Date/type of report",1,"M01 July"]
[null,null,null,null,null,null,null,null,null,null,null,null,null,null,null,null,null,null,null,null,null,null,2,"M02 August"]
[null,null,null,null,null,null,null,null,null,null,null,null,null,null,null,null,null,null,null,null,null,null,3,"M03 September"]
[null,null,null,null,null,null,null,null,null,null,null,null,null,null,null,null,null,null,null,null,null,null,4,"M04 October"]
[null,null,null,null,null,null,null,null,null,null,null,null,null,null,null,null,null,null,null,null,null,null,5,"M05 November"]
[null,null,null,null,null,null,null,null,null,null,null,null,null,null,null,null,null,null,null,null,null,null,6,"M06 December"]
[null,null,null,null,null,null,null,null,null,null,null,null,null,null,null,null,null,null,null,null,null,null,7,"M07 January"]
[null,null,null,null,null,null,null,null,null,null,null,null,null,null,null,null,null,null,null,null,null,null,8,"M08 February"]
[null,null,null,null,null,null,null,null,null,null,null,null,null,null,null,null,null,null,null,null,null,null,9,"M09 March"]
[null,null,null,null,null,null,null,null,null,null,null,null,null,null,null,null,null,null,null,null,null,null,10,"M10 April"]
[null,null,null,null,null,null,null,null,null,null,null,null,null,null,null,null,null,null,null,null,null,null,11,"M11 May"]
[null,null,null,null,null,null,null,null,null,null,null,null,null,null,null,null,null,null,null,null,null,null,12,"M12 June"]
[null,null,null,null,null,null,null,null,null,null,null,null,null,null,null,null,null,null,null,null,null,null,13,"Q1 First Quarter"]
[null,null,null,null,null,null,null,null,null,null,null,null,null,null,null,null,null,null,null,null,null,null,14,"Q2 Second Quarter"]
[null,null,null,null,null,null,null,null,null,null,null,null,null,null,null,null,null,null,null,null,null,null,15,"Q3 Third Quarter"]
[null,null,null,null,null,null,null,null,null,null,null,null,null,null,null,null,null,null,null,null,null,null,16,"Q4 Fourth Quarter"]
[null,null,null,null,null,null,null,null,null,null,null,null,null,null,null,null,null,null,null,null,null,null,17,"Mid-Year Assessment"]

{"sheet":"Template names","index":2,"n_rows":107,"n_cols":6,"rows_kept":107,"cut":false,"hidden":true,"merged":[[0,0,0,3],[75,0,75,1],[71,0,71,3]]}
["Common sheet headings"]
["Head1",{"$f":"HLOOKUP(MTREF,Headings,2)","v":"2022/23"},"Prior year -1"]
["Head2",{"$f":"HLOOKUP(MTREF,Headings,5)","v":"Budget Year 2023/24"},"Year of approved budget"]
["Head2A",{"$f":"HLOOKUP(MTREF,Headings,4)","v":"2023/24"},"Approved budget year"]
["Head3",{"$f":"HLOOKUP(MTREF,Headings,3)","v":"2023/24 Medium Term Revenue & Expenditure Framework"},"MTREF header name"]
["Head5","Audited Outcome"]
["Head5A","Outcome"]
["Head5B","Pre-audit outcome"]
["Head6","Original Budget"]
["Head7","Adjusted Budget"]
["Head8","Full Year Forecast"]
["Head9",{"$f":"HLOOKUP(MTREF,Headings,5)","v":"Budget Year 2023/24"},"1st year of MTREF","Year1"]
["Head10",{"$f":"HLOOKUP(MTREF,Headings,6)","v":"Budget Year +1 2024/25"},"2nd year of MTREF","Year2"]
["Head11",{"$f":"HLOOKUP(MTREF,Headings,7)","v":"Budget Year +2 2025/26"},"3rd year of MTREF","Year3"]
["Head12","Forecast 2010/11",null,"Year4"]
["Head13","Forecast 2011/12",null,"Year5"]
["Head14","Forecast 2012/13",null,"Year6"]
["Head15","Forecast 2013/14",null,"Year7"]
["Head16","Forecast 2014/15",null,"Year8"]
["Head17","Forecast 2015/16",null,"Year9"]
["Head18","Forecast 2016/17",null,"Year10"]
["Head19","Forecast 2017/18",null,"Year11"]
["Head20","Forecast 2018/19",null,"Year12"]
["Head21","Forecast 2019/20",null,"Year13"]
["Head22","Forecast 2020/21",null,"Year14"]
["Head23","Forecast 2021/22",null,"Year15"]
["Head24","Description",null,"Desc"]
["Head25","Schedule of funding diligence",null,"fdil"]
["Head26","Vote Description",null,"VDesc"]
["Head27","Ref"]
["Head27a","References"]
["Head28","Surplus/ (Deficit) for the year",null,"Result"]
["Head29","Annual target 2007/08"]
["Head30","Revised target 2007/08"]
["Head31","Quarter ended 30 September"]
["Head32","Quarter ended 31 December"]
["Head33","Quarter ended 31 March"]
["Head34","Quarter ended 30 June"]
["Head35","Variance explanation"]
["Head36","YTD  Actual 31 Dec"]
["Head37","YTD  Budget 31 Dec"]
["Head38","Monthly actual"]
["Head39","YearTD actual"]
["Head40","YearTD budget"]
["Head41","YTD variance"]
["Head42","Surplus/ (Deficit) for the yr/period"]
["Head43",{"$f":"Head3&\" Summary\"","v":"2023/24 Medium Term Revenue & Expenditure Framework Summary"}]
["Head44","1996 Census"]
["Head45","2001 Census"]
["Head46"," - Adjustments Budget - Month YYYY"]
["Head47","Previous target year to complete"]
["Head48","Present value"]
["Head49","Virement"]
["Head50","Other Adjusts."]
["Head51","Accum. Funds"]
["Head52","Multi-year capital"]
["Head53","Unfore. Unavoid."]
["Head54","Prior Adjusted"]
["Head55","Nat. or Prov. Govt"]
["Head56","Total Adjusts."]
["Head57",{"$f":"date","v":"M11 May"}]
["Head58","Parent muni."]
["Head59","Downward adjusts"]
["Head60","Month","Report header part name",{"$f":"date","v":"M11 May"}]
["SFPerf1","Budgeted Financial Performance"]
["SFPerf2","Forecast Financial Performance"]
["SFPos1","Budgeted Financial Position"]
["SFPos2","Forecast Financial Position"]
["Cash1","Budget Cash Flow"]
["Cash2","Forecast Cash Flow"]
["RandM","Expenditure includes repairs & maintenance of R'000"]
["Standard nomenclature"]
["Muni",{"$f":"'Lookup and lists'!B27","v":"KZN225 Msunduzi"}]
["Municipal Entities",1,"Type of report:",2]
[{"$f":"IF((MuniEntities=1)*(MuniType=2),\"YES\",\"NO\")","v":"YES"},"Does this municipality have entities (consolidated budget and entity budgets required)? YES/NO"]
["s71 (Monthly Mayor report) schedules and charts"]
["S71sum",{"$f":"IF(Consolques=\"YES\",E77,F77)","v":"Table C1 Consolidated Monthly Budget Statement Summary"},null,"Table C1 ",{"$f":"D77&\"Consolidated Monthly Budget Statement Summary\"","v":"Table C1 Consolidated Monthly Budget Statement Summary"},{"$f":"D77&\"Monthly Budget Statement Summary\"","v":"Table C1 Monthly Budget Statement Summary"}]
["S71C","Table C3 Consolidated Monthly Budget Statement - Financial Performance (revenue and expenditure by municipal vote) ",null,"Table C3 ",{"$f":"D78&\"Consolidated Monthly Budget Statement - Financial Performance (revenue and expenditure by municipal vote) \"","v":"Table C3 Consolidated Monthly Budget Statement - Financial Performance (revenue and expenditure by municipal vote) "},{"$f":"D78&\"Monthly Budget Statement - Financial Performance (revenue and expenditure by municipal vote)\"","v":"Table C3 Monthly Budget Statement - Financial Performance (revenue and expenditure by municipal vote)"}]
["S71A",{"$f":"IF(Consolques=\"YES\",E79,F79)","v":"Table C2 Consolidated Monthly Budget Statement - Financial Performance (functional classification) "},null,"Table C2 ",{"$f":"D79&\"Consolidated Monthly Budget Statement - Financial Performance (functional classification) \"","v":"Table C2 Consolidated Monthly Budget Statement - Financial Performance (functional classification) "},{"$f":"D79&\"Monthly Budget Statement - Financial Performance (functional classification)\"","v":"Table C2 Monthly Budget Statement - Financial Performance (functional classification)"}]
["S71B",{"$f":"IF(Consolques=\"YES\",E80,F80)","v":"Table C4 Consolidated Monthly Budget Statement - Financial Performance (revenue and expenditure) "},null,"Table C4 ",{"$f":"D80&\"Consolidated Monthly Budget Statement - Financial Performance (revenue and expenditure) \"","v":"Table C4 Consolidated Monthly Budget Statement - Financial Performance (revenue and expenditure) "},{"$f":"D80&\"Monthly Budget Statement - Financial Performance (revenue and expenditure)\"","v":"Table C4 Monthly Budget Statement - Financial Performance (revenue and expenditure)"}]
["S71D",{"$f":"IF(Consolques=\"YES\",E81,F81)","v":"Table C5 Consolidated Monthly Budget Statement - Capital Expenditure (municipal vote, functional classification and funding "},null,"Table C5 ",{"$f":"D81&\"Consolidated Monthly Budget Statement - Capital Expenditure (municipal vote, functional classification and funding \"","v":"Table C5 Consolidated Monthly Budget Statement - Capital Expenditure (municipal vote, functional classification and funding "},{"$f":"D81&\"Monthly Budget Statement - Capital Expenditure (municipal vote, functional classification and funding)\"","v":"Table C5 Monthly Budget Statement - Capital Expenditure (municipal vote, functional classification and funding)"}]
["S71E","Table C6 Consolidated Monthly Budget Statement - Financial Position ",null,"Table C6 ",{"$f":"D82&\"Consolidated Monthly Budget Statement - Financial Position \"","v":"Table C6 Consolidated Monthly Budget Statement - Financial Position "},{"$f":"D82&\"Monthly Budget Statement - Financial Position\"","v":"Table C6 Monthly Budget Statement - Financial Position"}]
["S71F","Table C7 Consolidated Monthly Budget Statement - Cash Flow ",null,"Table C7 ",{"$f":"D83&\"Consolidated Monthly Budget Statement - Cash Flow \"","v":"Table C7 Consolidated Monthly Budget Statement - Cash Flow "},{"$f":"D83&\"Monthly Budget Statement - Cash Flow \"","v":"Table C7 Monthly Budget Statement - Cash Flow "}]
["S71G",{"$f":"D84&\"Material variance explanations \"","v":"Supporting Table SC1 Material variance explanations "},null,"Supporting Table SC1 "]
["S71H",{"$f":"D85&\"Monthly Budget Statement - performance indicators  \"","v":"Supporting Table SC2 Monthly Budget Statement - performance indicators  "},null,"Supporting Table SC2 "]
["S71I",{"$f":"D86&\"Monthly Budget Statement - aged debtors\"","v":"Supporting Table SC3 Monthly Budget Statement - aged debtors"},null,"Supporting Table SC3 "]
["S71J",{"$f":"D87&\"Monthly Budget Statement - aged creditors \"","v":"Supporting Table SC4 Monthly Budget Statement - aged creditors "},null,"Supporting Table SC4 "]
["S71K",{"$f":"D88&\"Monthly Budget Statement - investment portfolio \"","v":"Supporting Table SC5 Monthly Budget Statement - investment portfolio "},null,"Supporting Table SC5 "]
["S71L",{"$f":"D89&\"Monthly Budget Statement - transfers and grant receipts \"","v":"Supporting Table SC6 Monthly Budget Statement - transfers and grant receipts "},null,"Supporting Table SC6 "]
["S71M",{"$f":"D90&\" Monthly Budget Statement - transfers and grant expenditure \"","v":"Supporting Table SC7(1) Monthly Budget Statement - transfers and grant expenditure "},null,"Supporting Table SC7(1)"]
["S71N",{"$f":"D91&\"Monthly Budget Statement - councillor and staff benefits \"","v":"Supporting Table SC8 Monthly Budget Statement - councillor and staff benefits "},null,"Supporting Table SC8 "]
["S71O",{"$f":"D92&\"Monthly Budget Statement - actuals and revised targets for cash receipts\"","v":"Supporting Table SC9 Monthly Budget Statement - actuals and revised targets for cash receipts"},null,"Supporting Table SC9 "]
["S71P",{"$f":"IF(Consolques=\"YES\",E93,F93)","v":"Supporting Table SC10 Monthly Budget Statement  - Parent Municipality Financial Performance (revenue and expenditure) "},null,"Supporting Table SC10 ",{"$f":"D93&\"Monthly Budget Statement  - Parent Municipality Financial Performance (revenue and expenditure) \"","v":"Supporting Table SC10 Monthly Budget Statement  - Parent Municipality Financial Performance (revenue and expenditure) "},"NOT REQUIRED - municipality does not have entities or this is the parent municipality's budget"]
["S71Q","Supporting Table SC11 Monthly Budget Statement - summary of municipal entities",null,"Supporting Table SC11 ",{"$f":"D94&\"Monthly Budget Statement - summary of municipal entities\"","v":"Supporting Table SC11 Monthly Budget Statement - summary of municipal entities"},"NOT REQUIRED - municipality does not have entities or this is the parent municipality's budget"]
["S71R","Supporting Table SC12 Consolidated Monthly Budget Statement - capital expenditure trend ",null,"Supporting Table SC12 ",{"$f":"D95&\"Consolidated Monthly Budget Statement - capital expenditure trend \"","v":"Supporting Table SC12 Consolidated Monthly Budget Statement - capital expenditure trend "},{"$f":"D95&\"Monthly Budget Statement - capital expenditure trend\"","v":"Supporting Table SC12 Monthly Budget Statement - capital expenditure trend"}]
["S71Sa","Supporting Table SC13a Consolidated Monthly Budget Statement - capital expenditure on new assets by asset class",null,"Supporting Table SC13a ",{"$f":"D96&\"Consolidated Monthly Budget Statement - capital expenditure on new assets by asset class\"","v":"Supporting Table SC13a Consolidated Monthly Budget Statement - capital expenditure on new assets by asset class"},{"$f":"D96&\"Monthly Budget Statement - capital expenditure on new assets by asset class\"","v":"Supporting Table SC13a Monthly Budget Statement - capital expenditure on new assets by asset class"}]
["S71Sb","Supporting Table SC13b Consolidated Monthly Budget Statement - capital expenditure on renewal of existing assets by asset class",null,"Supporting Table SC13b ",{"$f":"D97&\"Consolidated Monthly Budget Statement - capital expenditure on renewal of existing assets by asset class\"","v":"Supporting Table SC13b Consolidated Monthly Budget Statement - capital expenditure on renewal of existing assets by asset class"},{"$f":"D97&\"Monthly Budget Statement - capital expenditure on renewal of existing assets by asset class\"","v":"Supporting Table SC13b Monthly Budget Statement - capital expenditure on renewal of existing assets by asset class"}]
["S71Sc","Supporting Table SC13c Consolidated Monthly Budget Statement - expenditure on repairs and maintenance by asset class",null,"Supporting Table SC13c ",{"$f":"D98&\"Consolidated Monthly Budget Statement - expenditure on repairs and maintenance by asset class\"","v":"Supporting Table SC13c Consolidated Monthly Budget Statement - expenditure on repairs and maintenance by asset class"},{"$f":"D98&\"Monthly Budget Statement - expenditure on repairs and maintenance by asset class\"","v":"Supporting Table SC13c Monthly Budget Statement - expenditure on repairs and maintenance by asset class"}]
["S71Sd","Supporting Table SC13d Consolidated Monthly Budget Statement - depreciation by asset class",null,"Supporting Table SC13d ",{"$f":"D99&\"Consolidated Monthly Budget Statement - depreciation by asset class\"","v":"Supporting Table SC13d Consolidated Monthly Budget Statement - depreciation by asset class"},{"$f":"D99&\"Monthly Budget Statement - depreciation by asset class\"","v":"Supporting Table SC13d Monthly Budget Statement - depreciation by asset class"}]
["S71Se",{"$f":"IF(Consolques=\"YES\",E100,F100)","v":"Supporting Table SC13e Consolidated Monthly Budget Statement - capital expenditure on upgrading of existing assets by asset class"},null,"Supporting Table SC13e ",{"$f":"D100&\"Consolidated Monthly Budget Statement - capital expenditure on upgrading of existing assets by asset class\"","v":"Supporting Table SC13e Consolidated Monthly Budget Statement - capital expenditure on upgrading of existing assets by asset class"},{"$f":"D100&\"Monthly Budget Statement - capital expenditure on upgrading of existing assets by asset class\"","v":"Supporting Table SC13e Monthly Budget Statement - capital expenditure on upgrading of existing assets by asset class"}]
[null,"s71 charts listing"]
[null,{"$f":"D102&Head2A&\" Capital Expenditure Monthly Trend: actual v target\"","v":"Chart C1 2023/24 Capital Expenditure Monthly Trend: actual v target"},null,"Chart C1 "]
[null,{"$f":"D103&Head2A&\" Capital Expenditure: YTD actual v YTD target\"","v":"Chart C2 2023/24 Capital Expenditure: YTD actual v YTD target"},null,"Chart C2 "]
[null,{"$f":"D104&\"Aged Consumer Debtors Analysis\"","v":"Chart C3 Aged Consumer Debtors Analysis"},null,"Chart C3 "]
[null,{"$f":"D105&\"Consumer Debtors (total by Debtor Customer Category)\"","v":"Chart C4 Consumer Debtors (total by Debtor Customer Category)"},null,"Chart C4 "]
[null,{"$f":"D106&\"Aged Creditors Analysis\"","v":"Chart C5 Aged Creditors Analysis"},null,"Chart C5 "]
["S71T",{"$f":"D107&\" Monthly Budget Statement - Expenditure against approved rollovers\"","v":"Supporting Table SC7(2) Monthly Budget Statement - Expenditure against approved rollovers"},null,"Supporting Table SC7(2)"]

{"sheet":"Lookup and lists","index":3,"n_rows":307,"n_cols":22,"rows_kept":307,"cut":false,"hidden":true,"merged":[]}
["Description",2013,2014,2015,2016,2017,2018,2019,2020,2021,2022,2023,2024,2025,2026,null,"Grants:","National - opex","Provincial - opex","National - capex","Provincial - capex","YESNO"]
[{"$f":"'Template names'!C2","v":"Prior year -1"},{"$f":"B1-1&\"/\"&RIGHT(B1,2)-0","v":"2012/13"},{"$f":"C1-1&\"/\"&RIGHT(C1,2)-0","v":"2013/14"},{"$f":"D1-1&\"/\"&RIGHT(D1,2)-0","v":"2014/15"},{"$f":"E1-1&\"/\"&RIGHT(E1,2)-0","v":"2015/16"},{"$f":"F1-1&\"/\"&RIGHT(F1,2)-0","v":"2016/17"},"2017/18","2018/19","2019/20","2020/21","2021/22","2022/23","2023/24","2024/25","2025/26",null,null,"Local Government Equitable Share","Health subsidy","Municipal Infrastructure Grant (MIG)","Agriculture","Yes"]
[{"$f":"'Template names'!C5","v":"MTREF header name"},{"$f":"B1&\"/\"&RIGHT(B1,2)+1&\" Medium Term Revenue & Expenditure Framework\"","v":"2013/14 Medium Term Revenue & Expenditure Framework"},{"$f":"C1&\"/\"&RIGHT(C1,2)+1&\" Medium Term Revenue & Expenditure Framework\"","v":"2014/15 Medium Term Revenue & Expenditure Framework"},{"$f":"D1&\"/\"&RIGHT(D1,2)+1&\" Medium Term Revenue & Expenditure Framework\"","v":"2015/16 Medium Term Revenue & Expenditure Framework"},{"$f":"E1&\"/\"&RIGHT(E1,2)+1&\" Medium Term Revenue & Expenditure Framework\"","v":"2016/17 Medium Term Revenue & Expenditure Framework"},{"$f":"F1&\"/\"&RIGHT(F1,2)+1&\" Medium Term Revenue & Expenditure Framework\"","v":"2017/18 Medium Term Revenue & Expenditure Framework"},"2018/19 Medium Term Revenue & Expenditure Framework","2019/20 Medium Term Revenue & Expenditure Framework","2020/21 Medium Term Revenue & Expenditure Framework","2021/22 Medium Term Revenue & Expenditure Framework","2022/23 Medium Term Revenue & Expenditure Framework","2023/24 Medium Term Revenue & Expenditure Framework","2024/25 Medium Term Revenue & Expenditure Framework","2025/26 Medium Term Revenue & Expenditure Framework","2026/27 Medium Term Revenue & Expenditure Framework",null,null,"RSC Levy Replacement ","Ambulance subsidy","Public Transport and Systems","Education","No"]
[{"$f":"'Template names'!C4","v":"Approved budget year"},{"$f":"B1&\"/\"&RIGHT(B1,2)+1","v":"2013/14"},{"$f":"C1&\"/\"&RIGHT(C1,2)+1","v":"2014/15"},{"$f":"D1&\"/\"&RIGHT(D1,2)+1","v":"2015/16"},{"$f":"E1&\"/\"&RIGHT(E1,2)+1","v":"2016/17"},{"$f":"F1&\"/\"&RIGHT(F1,2)+1","v":"2017/18"},"2018/19","2019/20","2020/21","2021/22","2022/23","2023/24","2024/25","2025/26","2026/27",null,null,"Finance Management ","Housing","Rural Transport Services and Infrastructure","Health"]
[{"$f":"'Template names'!C12","v":"1st year of MTREF"},{"$f":"\"Budget Year \"&B1&\"/\"&RIGHT(B1,2)+1","v":"Budget Year 2013/14"},{"$f":"\"Budget Year \"&C1&\"/\"&RIGHT(C1,2)+1","v":"Budget Year 2014/15"},{"$f":"\"Budget Year \"&D1&\"/\"&RIGHT(D1,2)+1","v":"Budget Year 2015/16"},{"$f":"\"Budget Year \"&E1&\"/\"&RIGHT(E1,2)+1","v":"Budget Year 2016/17"},{"$f":"\"Budget Year \"&F1&\"/\"&RIGHT(F1,2)+1","v":"Budget Year 2017/18"},"Budget Year 2018/19","Budget Year 2019/20","Budget Year 2020/21","Budget Year 2021/22","Budget Year 2022/23","Budget Year 2023/24","Budget Year 2024/25","Budget Year 2025/26","Budget Year 2026/27",null,null,"Municipal Systems Improvement","Sport and Recreation","Regional Bulk Infrastructure","Housing and Local Government "]
[{"$f":"'Template names'!C13","v":"2nd year of MTREF"},{"$f":"\"Budget Year +1 \"&B1+1&\"/\"&RIGHT(B1,2)+2","v":"Budget Year +1 2014/15"},{"$f":"\"Budget Year +1 \"&C1+1&\"/\"&RIGHT(C1,2)+2","v":"Budget Year +1 2015/16"},{"$f":"\"Budget Year +1 \"&D1+1&\"/\"&RIGHT(D1,2)+2","v":"Budget Year +1 2016/17"},{"$f":"\"Budget Year +1 \"&E1+1&\"/\"&RIGHT(E1,2)+2","v":"Budget Year +1 2017/18"},{"$f":"\"Budget Year +1 \"&F1+1&\"/\"&RIGHT(F1,2)+2","v":"Budget Year +1 2018/19"},"Budget Year +1 2019/20","Budget Year +1 2020/21","Budget Year +1 2021/22","Budget Year +1 2022/23","Budget Year +1 2023/24","Budget Year +1 2024/25","Budget Year +1 2025/26","Budget Year +1 2026/27","Budget Year +1 2027/28",null,null,"Water Services Operating Subsidy ",null,"Rural Households Infrastructure ","Other Departments"]
[{"$f":"'Template names'!C14","v":"3rd year of MTREF"},{"$f":"\"Budget Year +2 \"&B1+2&\"/\"&RIGHT(B1,2)+3","v":"Budget Year +2 2015/16"},{"$f":"\"Budget Year +2 \"&C1+2&\"/\"&RIGHT(C1,2)+3","v":"Budget Year +2 2016/17"},{"$f":"\"Budget Year +2 \"&D1+2&\"/\"&RIGHT(D1,2)+3","v":"Budget Year +2 2017/18"},{"$f":"\"Budget Year +2 \"&E1+2&\"/\"&RIGHT(E1,2)+3","v":"Budget Year +2 2018/19"},{"$f":"\"Budget Year +2 \"&F1+2&\"/\"&RIGHT(F1,2)+3","v":"Budget Year +2 2019/20"},"Budget Year +2 2020/21","Budget Year +2 2021/22","Budget Year +2 2022/23","Budget Year +2 2023/24","Budget Year +2 2024/25","Budget Year +2 2025/26","Budget Year +2 2026/27","Budget Year +2 2027/28","Budget Year +2 2028/29",null,null,"Energy Efficiency  and Demand Management",null,"Neighbourhood Development Partnership","Public Works, Roads, Transport "]
["NOTE: This sheet should not be directly amended - select headings from sheet 'S'",null,null,null,null,null,null,null,null,null,null,null,null,null,null,null,null,"Integrated National Electrification Programme",null,"2010 FIFA World Cup Stadiums Development","Sport and Recreation"]
[null,null,null,null,null,null,null,null,null,null,null,null,null,null,null,null,null,"Municipal Drought Relief "]
[null,null,null,null,null,null,null,null,null,null,null,null,null,null,null,null,null,"2010 FIFA World Cup Operating"]
[null,null,null,null,null,null,null,null,null,null,null,null,null,null,null,null,null,"Electricity Demand Side Management"]
[null,null,null,null,null,null,null,null,null,null,null,null,null,null,null,null,null,"EPWP Incentive"]
[]
[]
[]
[]
[]
[]
[]
[]
[]
[]
[]
[]
[]
["Name link",85]
["Name of Muni",{"$f":"INDEX(B28:B311,B26,1)","v":"KZN225 Msunduzi"}]
[null,"Choose name from list","Set name on 'Instructions' sheet"]
[null,"BUF Buffalo City","EC EASTERN CAPE"]
[null,"NMA Nelson Mandela Bay","EC EASTERN CAPE"]
[null,"EC101 Dr Beyers Naude","EC EASTERN CAPE"]
[null,"EC102 Blue Crane Route","EC EASTERN CAPE"]
[null,"EC104 Makana","EC EASTERN CAPE"]
[null,"EC105 Ndlambe","EC EASTERN CAPE"]
[null,"EC106 Sundays River Valley","EC EASTERN CAPE"]
[null,"EC108 Kouga","EC EASTERN CAPE"]
[null,"EC109 Kou-Kamma","EC EASTERN CAPE"]
[null,"DC10 Sarah Baartman","EC EASTERN CAPE"]
[null,"EC121 Mbhashe","EC EASTERN CAPE"]
[null,"EC122 Mnquma","EC EASTERN CAPE"]
[null,"EC123 Great Kei","EC EASTERN CAPE"]
[null,"EC124 Amahlathi","EC EASTERN CAPE"]
[null,"EC126 Ngqushwa","EC EASTERN CAPE"]
[null,"EC129 Raymond Mhlaba","EC EASTERN CAPE"]
[null,"DC12 Amathole","EC EASTERN CAPE"]
[null,"EC131 Inxuba Yethemba","EC EASTERN CAPE"]
[null,"EC135 Intsika Yethu","EC EASTERN CAPE"]
[null,"EC136 Emalahleni (Ec)","EC EASTERN CAPE"]
[null,"EC137 Engcobo","EC EASTERN CAPE"]
[null,"EC138 Sakhisizwe","EC EASTERN CAPE"]
[null,"EC139 Enoch Mgijima","EC EASTERN CAPE"]
[null,"DC13 Chris Hani","EC EASTERN CAPE"]
[null,"EC141 Elundini","EC EASTERN CAPE"]
[null,"EC142 Senqu","EC EASTERN CAPE"]
[null,"EC145 Walter Sisulu","EC EASTERN CAPE"]
[null,"DC14 Joe Gqabi","EC EASTERN CAPE"]
[null,"EC153 Ngquza Hills","EC EASTERN CAPE"]
[null,"EC154 Port St Johns","EC EASTERN CAPE"]
[null,"EC155 Nyandeni","EC EASTERN CAPE"]
[null,"EC156 Mhlontlo","EC EASTERN CAPE"]
[null,"EC157 King Sabata Dalindyebo","EC EASTERN CAPE"]
[null,"DC15 O .R. Tambo","EC EASTERN CAPE"]
[null,"EC441 Matatiele","EC EASTERN CAPE"]
[null,"EC442 Umzimvubu","EC EASTERN CAPE"]
[null,"EC443 Winnie Madikizela Mandela","EC EASTERN CAPE"]
[null,"EC444 Ntabankulu","EC EASTERN CAPE"]
[null,"DC44 Alfred Nzo","EC EASTERN CAPE"]
[null,"MAN Mangaung","FS FREE STATE"]
[null,"FS161 Letsemeng","FS FREE STATE"]
[null,"FS162 Kopanong","FS FREE STATE"]
[null,"FS163 Mohokare","FS FREE STATE"]
[null,"DC16 Xhariep","FS FREE STATE"]
[null,"FS181 Masilonyana","FS FREE STATE"]
[null,"FS182 Tokologo","FS FREE STATE"]
[null,"FS183 Tswelopele","FS FREE STATE"]
[null,"FS184 Matjhabeng","FS FREE STATE"]
[null,"FS185 Nala","FS FREE STATE"]
[null,"DC18 Lejweleputswa","FS FREE STATE"]
[null,"FS191 Setsoto","FS FREE STATE"]
[null,"FS192 Dihlabeng","FS FREE STATE"]
[null,"FS193 Nketoana","FS FREE STATE"]
[null,"FS194 Maluti-a-Phofung","FS FREE STATE"]
[null,"FS195 Phumelela","FS FREE STATE"]
[null,"FS196 Mantsopa","FS FREE STATE"]
[null,"DC19 Thabo Mofutsanyana","FS FREE STATE"]
[null,"FS201 Moqhaka","FS FREE STATE"]
[null,"FS203 Ngwathe","FS FREE STATE"]
[null,"FS204 Metsimaholo","FS FREE STATE"]
[null,"FS205 Mafube","FS FREE STATE"]
[null,"DC20 Fezile Dabi","FS FREE STATE"]
[null,"EKU City of Ekurhuleni","GT GAUTENG"]
[null,"JHB City Of Johannesburg","GT GAUTENG"]
[null,"TSH City Of Tshwane","GT GAUTENG"]
[null,"GT421 Emfuleni","GT GAUTENG"]
[null,"GT422 Midvaal","GT GAUTENG"]
[null,"GT423 Lesedi","GT GAUTENG"]
[null,"DC42 Sedibeng","GT GAUTENG"]
[null,"GT481 Mogale City","GT GAUTENG"]
[null,"GT484 Merafong City","GT GAUTENG"]
[null,"GT485 Rand West City","GT GAUTENG"]
[null,"DC48 West Rand","GT GAUTENG"]
[null,"ETH eThekwini","KZN KWAZULU-NATAL"]
[null,"KZN212 Umdoni","KZN KWAZULU-NATAL"]
[null,"KZN213 Umzumbe","KZN KWAZULU-NATAL"]
[null,"KZN214 uMuziwabantu","KZN KWAZULU-NATAL"]
[null,"KZN216 Ray Nkonyeni","KZN KWAZULU-NATAL"]
[null,"DC21 Ugu","KZN KWAZULU-NATAL"]
[null,"KZN221 uMshwathi","KZN KWAZULU-NATAL"]
[null,"KZN222 uMngeni","KZN KWAZULU-NATAL"]
[null,"KZN223 Mpofana","KZN KWAZULU-NATAL"]
[null,"KZN224 Impendle","KZN KWAZULU-NATAL"]
[null,"KZN225 Msunduzi","KZN KWAZULU-NATAL"]
[null,"KZN226 Mkhambathini","KZN KWAZULU-NATAL"]
[null,"KZN227 Richmond","KZN KWAZULU-NATAL"]
[null,"DC22 uMgungundlovu","KZN KWAZULU-NATAL"]
[null,"KZN235 Okhahlamba","KZN KWAZULU-NATAL"]
[null,"KZN237 Inkosi Langalibalele","KZN KWAZULU-NATAL"]
[null,"KZN238 Alfred Duma","KZN KWAZULU-NATAL"]
[null,"DC23 Uthukela","KZN KWAZULU-NATAL"]
[null,"KZN241 Endumeni","KZN KWAZULU-NATAL"]
[null,"KZN242 Nquthu","KZN KWAZULU-NATAL"]
[null,"KZN244 Msinga","KZN KWAZULU-NATAL"]
[null,"KZN245 Umvoti","KZN KWAZULU-NATAL"]
[null,"DC24 Umzinyathi","KZN KWAZULU-NATAL"]
[null,"KZN252 Newcastle","KZN KWAZULU-NATAL"]
[null,"KZN253 Emadlangeni","KZN KWAZULU-NATAL"]
[null,"KZN254 Dannhauser","KZN KWAZULU-NATAL"]
[null,"DC25 Amajuba","KZN KWAZULU-NATAL"]
[null,"KZN261 eDumbe","KZN KWAZULU-NATAL"]
[null,"KZN262 uPhongolo","KZN KWAZULU-NATAL"]
[null,"KZN263 Abaqulusi","KZN KWAZULU-NATAL"]
[null,"KZN265 Nongoma","KZN KWAZULU-NATAL"]
[null,"KZN266 Ulundi","KZN KWAZULU-NATAL"]
[null,"DC26 Zululand","KZN KWAZULU-NATAL"]
[null,"KZN271 Umhlabuyalingana","KZN KWAZULU-NATAL"]
[null,"KZN272 Jozini","KZN KWAZULU-NATAL"]
[null,"KZN275 Mtubatuba","KZN KWAZULU-NATAL"]
[null,"KZN276 Hlabisa Big Five","KZN KWAZULU-NATAL"]
[null,"DC27 Umkhanyakude","KZN KWAZULU-NATAL"]
[null,"KZN281 Mfolozi","KZN KWAZULU-NATAL"]
[null,"KZN282 uMhlathuze","KZN KWAZULU-NATAL"]
[null,"KZN284 uMlalazi","KZN KWAZULU-NATAL"]
[null,"KZN285 Mthonjaneni","KZN KWAZULU-NATAL"]
[null,"KZN286 Nkandla","KZN KWAZULU-NATAL"]
[null,"DC28 King Cetshwayo","KZN KWAZULU-NATAL"]
[null,"KZN291 Mandeni","KZN KWAZULU-NATAL"]
[null,"KZN292 KwaDukuza","KZN KWAZULU-NATAL"]
[null,"KZN293 Ndwedwe","KZN KWAZULU-NATAL"]
[null,"KZN294 Maphumulo","KZN KWAZULU-NATAL"]
[null,"DC29 iLembe","KZN KWAZULU-NATAL"]
[null,"KZN433 Greater Kokstad","KZN KWAZULU-NATAL"]
[null,"KZN434 Ubuhlebezwe","KZN KWAZULU-NATAL"]
[null,"KZN435 Umzimkhulu","KZN KWAZULU-NATAL"]
[null,"KZN436 Dr Nkosazana Dlamini Zuma","KZN KWAZULU-NATAL"]
[null,"DC43 Harry Gwala","KZN KWAZULU-NATAL"]
[null,"LIM331 Greater Giyani","LIM LIMPOPO"]
[null,"LIM332 Greater Letaba","LIM LIMPOPO"]
[null,"LIM333 Greater Tzaneen","LIM LIMPOPO"]
[null,"LIM334 Ba-Phalaborwa","LIM LIMPOPO"]
[null,"LIM335 Maruleng","LIM LIMPOPO"]
[null,"DC33 Mopani","LIM LIMPOPO"]
[null,"LIM341 Musina","LIM LIMPOPO"]
[null,"LIM343 Thulamela","LIM LIMPOPO"]
[null,"LIM344 Makhado","LIM LIMPOPO"]
[null,"LIM345 Collins Chabane","LIM LIMPOPO"]
[null,"DC34 Vhembe","LIM LIMPOPO"]
[null,"LIM351 Blouberg","LIM LIMPOPO"]
[null,"LIM353 Molemole","LIM LIMPOPO"]
[null,"LIM354 Polokwane","LIM LIMPOPO"]
[null,"LIM355 Lepelle-Nkumpi","LIM LIMPOPO"]
[null,"DC35 Capricorn","LIM LIMPOPO"]
[null,"LIM361 Thabazimbi","LIM LIMPOPO"]
[null,"LIM362 Lephalale","LIM LIMPOPO"]
[null,"LIM366 Bela Bela","LIM LIMPOPO"]
[null,"LIM367 Mogalakwena","LIM LIMPOPO"]
[null,"LIM368 Modimolle-Mookgopong","LIM LIMPOPO"]
[null,"DC36 Waterberg","LIM LIMPOPO"]
[null,"LIM471 Ephraim Mogale","LIM LIMPOPO"]
[null,"LIM472 Elias Motsoaledi","LIM LIMPOPO"]
[null,"LIM473 Makhuduthamaga","LIM LIMPOPO"]
[null,"LIM476 Tubatse Fetakgomo","LIM LIMPOPO"]
[null,"DC47 Sekhukhune","LIM LIMPOPO"]
[null,"MP301 Albert Luthuli","MP MPUMALANGA"]
[null,"MP302 Msukaligwa","MP MPUMALANGA"]
[null,"MP303 Mkhondo","MP MPUMALANGA"]
[null,"MP304 Pixley Ka Seme (MP)","MP MPUMALANGA"]
[null,"MP305 Lekwa","MP MPUMALANGA"]
[null,"MP306 Dipaleseng","MP MPUMALANGA"]
[null,"MP307 Govan Mbeki","MP MPUMALANGA"]
[null,"DC30 Gert Sibande","MP MPUMALANGA"]
[null,"MP311 Victor Khanye","MP MPUMALANGA"]
[null,"MP312 Emalahleni (Mp)","MP MPUMALANGA"]
[null,"MP313 Steve Tshwete","MP MPUMALANGA"]
[null,"MP314 Emakhazeni","MP MPUMALANGA"]
[null,"MP315 Thembisile Hani","MP MPUMALANGA"]
[null,"MP316 Dr J.S. Moroka","MP MPUMALANGA"]
[null,"DC31 Nkangala","MP MPUMALANGA"]
[null,"MP321 Thaba Chweu","MP MPUMALANGA"]
[null,"MP324 Nkomazi","MP MPUMALANGA"]
[null,"MP325 Bushbuckridge","MP MPUMALANGA"]
[null,"MP326 City of Mbombela","MP MPUMALANGA"]
[null,"DC32 Ehlanzeni","MP MPUMALANGA"]
[null,"NC451 Joe Morolong","NC NORTHERN CAPE"]
[null,"NC452 Ga-Segonyana","NC NORTHERN CAPE"]
[null,"NC453 Gamagara","NC NORTHERN CAPE"]
[null,"DC45 John Taolo Gaetsewe","NC NORTHERN CAPE"]
[null,"NC061 Richtersveld","NC NORTHERN CAPE"]
[null,"NC062 Nama Khoi","NC NORTHERN CAPE"]
[null,"NC064 Kamiesberg","NC NORTHERN CAPE"]
[null,"NC065 Hantam","NC NORTHERN CAPE"]
[null,"NC066 Karoo Hoogland","NC NORTHERN CAPE"]
[null,"NC067 Khai-Ma","NC NORTHERN CAPE"]
[null,"DC6 Namakwa","NC NORTHERN CAPE"]
[null,"NC071 Ubuntu","NC NORTHERN CAPE"]
[null,"NC072 Umsobomvu","NC NORTHERN CAPE"]
[null,"NC073 Emthanjeni","NC NORTHERN CAPE"]
[null,"NC074 Kareeberg","NC NORTHERN CAPE"]
[null,"NC075 Renosterberg","NC NORTHERN CAPE"]
[null,"NC076 Thembelihle","NC NORTHERN CAPE"]
[null,"NC077 Siyathemba","NC NORTHERN CAPE"]
[null,"NC078 Siyancuma","NC NORTHERN CAPE"]
[null,"DC7 Pixley Ka Seme (Nc)","NC NORTHERN CAPE"]
[null,"NC082 !Kai! Garib","NC NORTHERN CAPE"]
[null,"NC084 !Kheis","NC NORTHERN CAPE"]
[null,"NC085 Tsantsabane","NC NORTHERN CAPE"]
[null,"NC086 Kgatelopele","NC NORTHERN CAPE"]
[null,"NC087 Dawid Kruiper","NC NORTHERN CAPE"]
[null,"DC8 Z F Mgcawu","NC NORTHERN CAPE"]
[null,"NC091 Sol Plaatje","NC NORTHERN CAPE"]
[null,"NC092 Dikgatlong","NC NORTHERN CAPE"]
[null,"NC093 Magareng","NC NORTHERN CAPE"]
[null,"NC094 Phokwane","NC NORTHERN CAPE"]
[null,"DC9 Frances Baard","NC NORTHERN CAPE"]
[null,"NW371 Moretele","NW NORTH WEST"]
[null,"NW372 Madibeng","NW NORTH WEST"]
[null,"NW373 Rustenburg","NW NORTH WEST"]
[null,"NW374 Kgetlengrivier","NW NORTH WEST"]
[null,"NW375 Moses Kotane","NW NORTH WEST"]
[null,"DC37 Bojanala Platinum","NW NORTH WEST"]
[null,"NW381 Ratlou","NW NORTH WEST"]
[null,"NW382 Tswaing","NW NORTH WEST"]
[null,"NW383 Mafikeng","NW NORTH WEST"]
[null,"NW384 Ditsobotla","NW NORTH WEST"]
[null,"NW385 Ramotshere Moiloa","NW NORTH WEST"]
[null,"DC38 Ngaka Modiri Molema","NW NORTH WEST"]
[null,"NW392 Naledi (Nw)","NW NORTH WEST"]
[null,"NW393 Mamusa","NW NORTH WEST"]
[null,"NW394 Greater Taung","NW NORTH WEST"]
[null,"NW396 Lekwa-Teemane","NW NORTH WEST"]
[null,"NW397 Kagisano-Molopo","NW NORTH WEST"]
[null,"DC39 Dr Ruth Segomotsi Mompati","NW NORTH WEST"]
[null,"NW403 City Of Matlosana","NW NORTH WEST"]
[null,"NW404 Maquassi Hills","NW NORTH WEST"]
[null,"NW405 J B Marks","NW NORTH WEST"]
[null,"DC40 Dr Kenneth Kaunda","NW NORTH WEST"]
[null,"CPT Cape Town","WC WESTERN CAPE"]
[null,"WC011 Matzikama","WC WESTERN CAPE"]
[null,"WC012 Cederberg","WC WESTERN CAPE"]
[null,"WC013 Bergrivier","WC WESTERN CAPE"]
[null,"WC014 Saldanha Bay","WC WESTERN CAPE"]
[null,"WC015 Swartland","WC WESTERN CAPE"]
[null,"DC1 West Coast","WC WESTERN CAPE"]
[null,"WC022 Witzenberg","WC WESTERN CAPE"]
[null,"WC023 Drakenstein","WC WESTERN CAPE"]
[null,"WC024 Stellenbosch","WC WESTERN CAPE"]
[null,"WC025 Breede Valley","WC WESTERN CAPE"]
[null,"WC026 Langeberg","WC WESTERN CAPE"]
[null,"DC2 Cape Winelands DM","WC WESTERN CAPE"]
[null,"WC031 Theewaterskloof","WC WESTERN CAPE"]
[null,"WC032 Overstrand","WC WESTERN CAPE"]
[null,"WC033 Cape Agulhas","WC WESTERN CAPE"]
[null,"WC034 Swellendam","WC WESTERN CAPE"]
[null,"DC3 Overberg","WC WESTERN CAPE"]
[null,"WC041 Kannaland","WC WESTERN CAPE"]
[null,"WC042 Hessequa","WC WESTERN CAPE"]
[null,"WC043 Mossel Bay","WC WESTERN CAPE"]
[null,"WC044 George","WC WESTERN CAPE"]
[null,"WC045 Oudtshoorn","WC WESTERN CAPE"]
[null,"WC047 Bitou","WC WESTERN CAPE"]
[null,"WC048 Knysna","WC WESTERN CAPE"]
[null,"DC4 Garden Route","WC WESTERN CAPE"]
[null,"WC051 Laingsburg","WC WESTERN CAPE"]
[null,"WC052 Prince Albert","WC WESTERN CAPE"]
[null,"WC053 Beaufort West","WC WESTERN CAPE"]
[null,"DC5 Central Karoo","WC WESTERN CAPE"]
[]
[]
[]
[]
[]
[]
[]
[]
[]
[]
[]
[]
[]
[]
[]
[]
[]
[]
[]
[]
[]
[null,null,{"$f":"COUNTA(C29:C306)","v":257}]

{"sheet":"Org structure","index":4,"n_rows":166,"n_cols":5,"rows_kept":166,"cut":false,"hidden":false,"merged":[]}
["Organisational Structure Votes",null,"Organisational Structure Sub-Votes",null,"Display Sub-Votes"]
[{"$f":"B2&\" - \"&C2","v":"Vote 1 - City Manager"},"Vote 1","City Manager"]
[{"$f":"B13&\" - \"& C13","v":"Vote 2 - City Finance"},1.1000000000000001,"Internal Audit and Compliance",{"$f":"CONCATENATE(B3, \" - \", C3)","v":"1,1 - Internal Audit and Compliance"},"1.1 - Internal Audit and Compliance"]
[{"$f":"B24&\" - \"&C24","v":"Vote 3 - Corporate Services"},1.2,"Office of the City Manager","1,2 - Office of the City Manager","1.2 - Office of the City Manager"]
[{"$f":"B35&\" - \"&C35","v":"Vote 4 - Community Services and Social Equity"},1.3,"Political Support","1,3 - Political Support","1.3 - Political Support"]
[{"$f":"B46&\" - \"&C46","v":"Vote 5 - Infrastructure Services"},1.4,"Strategic Planning","1,4 - Strategic Planning","1.4 - Strategic Planning"]
[{"$f":"B57&\" - \"&C57","v":"Vote 6 - Sustainable Development and City Enterprises"},1.5,"[Name of sub-vote]","1.5 - [Name of sub-vote]"]
[{"$f":"B68&\" - \"&C68","v":"Vote 7 - Electricity"},1.6,"[Name of sub-vote]","1.6 - [Name of sub-vote]"]
[{"$f":"B79&\" - \"&C79","v":"Vote 8 - [NAME OF VOTE 8]"},1.7,"[Name of sub-vote]","1.7 - [Name of sub-vote]"]
[{"$f":"B90&\" - \"&C90","v":"Vote 9 - [NAME OF VOTE 9]"},1.8,"[Name of sub-vote]","1.8 - [Name of sub-vote]"]
[{"$f":"B101&\" - \"&C101","v":"Vote 10 - [NAME OF VOTE 10]"},1.9,"[Name of sub-vote]","1.9 - [Name of sub-vote]"]
[{"$f":"B112&\" - \"&C112","v":"Vote 11 - [NAME OF VOTE 11]"},"1.10","[Name of sub-vote]","1.10 - [Name of sub-vote]"]
[{"$f":"B123&\" - \"&C123","v":"Vote 12 - [NAME OF VOTE 12]"},"Vote 2","City Finance"]
[{"$f":"B134&\" - \"&C134","v":"Vote 13 - [NAME OF VOTE 13]"},2.1,"Asset Management",{"$f":"CONCATENATE(B14, \" - \", C14)","v":"2,1 - Asset Management"},"2.1 - Asset Management"]
[{"$f":"B145&\" - \"&C145","v":"Vote 14 - [NAME OF VOTE 14]"},2.2000000000000002,"Budget and Treasury Management","2,2 - Budget and Treasury Management","2.2 - Budget and Treasury Management"]
[{"$f":"B156&\" - \"&C156","v":"Vote 15 - [NAME OF VOTE 15]"},2.2999999999999998,"Expenditure Management","2,3 - Expenditure Management","2.3 - Expenditure Management"]
[null,2.4,"Revenue Management","2,4 - Revenue Management","2.4 - Revenue Management"]
[null,2.5,"Supply Chain Management","2,5 - Supply Chain Management","2.5 - Supply Chain Management"]
[null,2.6,"[Name of sub-vote]","2.6 - [Name of sub-vote]"]
[null,2.7,"[Name of sub-vote]","2.7 - [Name of sub-vote]"]
[null,2.8,"[Name of sub-vote]","2.8 - [Name of sub-vote]"]
[null,2.9,"[Name of sub-vote]","2.9 - [Name of sub-vote]"]
[null,"2.10","[Name of sub-vote]","2.10 - [Name of sub-vote]"]
[null,"Vote 3","Corporate Services"]
[null,3.1,"Human Resources Management",{"$f":"CONCATENATE(B25, \" - \", C25)","v":"3,1 - Human Resources Management"},"3.1 - Human Resources Management"]
[null,3.2,"Information Technology","3,2 - Information Technology","3.2 - Information Technology"]
[null,3.3,"Legal Services","3,3 - Legal Services","3.3 - Legal Services"]
[null,3.4,"Secretariat and Auxiliary Services","3,4 - Secretariat and Auxiliary Services","3.4 - Secretariat and Auxiliary Services"]
[null,3.5,"General Manager: Corporate Service","3,5 - General Manager: Corporate Service","3.5 - General Manager: Corporate Service"]
[null,3.6,"[Name of sub-vote]","3.6 - [Name of sub-vote]"]
[null,3.7,"[Name of sub-vote]","3.7 - [Name of sub-vote]"]
[null,3.8,"[Name of sub-vote]","3.8 - [Name of sub-vote]"]
[null,3.9,"[Name of sub-vote]","3.9 - [Name of sub-vote]"]
[null,"3.10","[Name of sub-vote]","3.10 - [Name of sub-vote]"]
[null,"Vote 4","Community Services and Social Equity"]
[null,4.0999999999999996,"Area Based Management ",{"$f":"CONCATENATE(B36, \" - \", C36)","v":"4,1 - Area Based Management "},"4.1 - Area Based Management "]
[null,4.2,"Public Safety, Emergency Services and Enforcement","4,2 - Public Safety, Emergency Services and Enforcement","4.2 - Public Safety, Emergency Services and Enforcement"]
[null,4.3,"Recreation and Facilities","4,3 - Recreation and Facilities","4.3 - Recreation and Facilities"]
[null,4.4000000000000004,"Waste Management","4,4 - Waste Management","4.4 - Waste Management"]
[null,4.5,"[Name of sub-vote]","4.5 - [Name of sub-vote]"]
[null,4.5999999999999996,"[Name of sub-vote]","4.6 - [Name of sub-vote]"]
[null,4.7,"[Name of sub-vote]","4.7 - [Name of sub-vote]"]
[null,4.8,"[Name of sub-vote]","4.8 - [Name of sub-vote]"]
[null,4.9000000000000004,"[Name of sub-vote]","4.9 - [Name of sub-vote]"]
[null,"4.10","[Name of sub-vote]","4.10 - [Name of sub-vote]"]
[null,"Vote 5","Infrastructure Services"]
[null,5.0999999999999996,"Project Management Office",{"$f":"CONCATENATE(B47, \" - \", C47)","v":"5,1 - Project Management Office"},"5.1 - Project Management Office"]
[null,5.2,"Roads and Transportation","5,2 - Roads and Transportation","5.2 - Roads and Transportation"]
[null,5.3,"Water and Sanitation","5,3 - Water and Sanitation","5.3 - Water and Sanitation"]
[null,5.4,"General Manager: Infrastructure ","5,4 - General Manager: Infrastructure ","5.4 - General Manager: Infrastructure "]
[null,5.5,"[Name of sub-vote]","5.5 - [Name of sub-vote]"]
[null,5.6,"[Name of sub-vote]","5.6 - [Name of sub-vote]"]
[null,5.7,"[Name of sub-vote]","5.7 - [Name of sub-vote]"]
[null,5.8,"[Name of sub-vote]","5.8 - [Name of sub-vote]"]
[null,5.9,"[Name of sub-vote]","5.9 - [Name of sub-vote]"]
[null,"5.10","[Name of sub-vote]","5.10 - [Name of sub-vote]"]
[null,"Vote 6","Sustainable Development and City Enterprises"]
[null,6.1,"City Entities",{"$f":"CONCATENATE(B58, \" - \", C58)","v":"6,1 - City Entities"},"6.1 - City Entities"]
[null,6.2,"Development Services","6,2 - Development Services","6.2 - Development Services"]
[null,6.3,"Human Settlement Development","6,3 - Human Settlement Development","6.3 - Human Settlement Development"]
[null,6.4,"Town Planning","6,4 - Town Planning","6.4 - Town Planning"]
[null,6.5,"General Manager: Sustainable Development and City Enterprises","6,5 - General Manager: Sustainable Development and City Enterprises","6.5 - General Manager: Sustainable Development and City Enterprises"]
[null,6.6,"[Name of sub-vote]","6.6 - [Name of sub-vote]"]
[null,6.7,"[Name of sub-vote]","6.7 - [Name of sub-vote]"]
[null,6.8,"[Name of sub-vote]","6.8 - [Name of sub-vote]"]
[null,6.9,"[Name of sub-vote]","6.9 - [Name of sub-vote]"]
[null,"6.10","[Name of sub-vote]","6.10 - [Name of sub-vote]"]
[null,"Vote 7","Electricity"]
[null,7.1,"Electricity planning",{"$f":"CONCATENATE(B69, \" - \", C69)","v":"7,1 - Electricity planning"},"7.1 Electricity planning"]
[null,7.2,"Methods and Standards","7,2 - Methods and Standards","7.2 Methods and Standards"]
[null,7.3,"Operations and Maintenance","7,3 - Operations and Maintenance","7.3 Operations and Maintenance"]
[null,7.4,"Revenue Management","7,4 - Revenue Management","7.4 Revenue Management"]
[null,7.5,"General Manager Electricity","7,5 - General Manager Electricity","7.5 General Manager Electricity"]
[null,7.6,"[Name of sub-vote]","7.6 - [Name of sub-vote]"]
[null,7.7,"[Name of sub-vote]","7.7 - [Name of sub-vote]"]
[null,7.8,"[Name of sub-vote]","7.8 - [Name of sub-vote]"]
[null,7.9,"[Name of sub-vote]","7.9 - [Name of sub-vote]"]
[null,"7.10","[Name of sub-vote]","7.10 - [Name of sub-vote]"]
[null,"Vote 8","[NAME OF VOTE 8]"]
[null,8.1,"[Name of sub-vote]",{"$f":"CONCATENATE(B80, \" - \", C80)","v":"8.1 - [Name of sub-vote]"},"8.1 - [Name of sub-vote]"]
[null,8.1999999999999993,"[Name of sub-vote]","8.2 - [Name of sub-vote]"]
[null,8.3000000000000007,"[Name of sub-vote]","8.3 - [Name of sub-vote]"]
[null,8.4,"[Name of sub-vote]","8.4 - [Name of sub-vote]"]
[null,8.5,"[Name of sub-vote]","8.5 - [Name of sub-vote]"]
[null,8.6,"[Name of sub-vote]","8.6 - [Name of sub-vote]"]
[null,8.6999999999999993,"[Name of sub-vote]","8.7 - [Name of sub-vote]"]
[null,8.8000000000000007,"[Name of sub-vote]","8.8 - [Name of sub-vote]"]
[null,8.9,"[Name of sub-vote]","8.9 - [Name of sub-vote]"]
[null,"8.10","[Name of sub-vote]","8.10 - [Name of sub-vote]"]
[null,"Vote 9","[NAME OF VOTE 9]"]
[null,9.1,"[Name of sub-vote]",{"$f":"CONCATENATE(B91, \" - \", C91)","v":"9.1 - [Name of sub-vote]"},"9.1 - [Name of sub-vote]"]
[null,9.1999999999999993,"[Name of sub-vote]","9.2 - [Name of sub-vote]"]
[null,9.3000000000000007,"[Name of sub-vote]","9.3 - [Name of sub-vote]"]
[null,9.4,"[Name of sub-vote]","9.4 - [Name of sub-vote]"]
[null,9.5,"[Name of sub-vote]","9.5 - [Name of sub-vote]"]
[null,9.6,"[Name of sub-vote]","9.6 - [Name of sub-vote]"]
[null,9.6999999999999993,"[Name of sub-vote]","9.7 - [Name of sub-vote]"]
[null,9.8000000000000007,"[Name of sub-vote]","9.8 - [Name of sub-vote]"]
[null,9.9,"[Name of sub-vote]","9.9 - [Name of sub-vote]"]
[null,"9.10","[Name of sub-vote]","9.10 - [Name of sub-vote]"]
[null,"Vote 10","[NAME OF VOTE 10]"]
[null,10.1,"[Name of sub-vote]",{"$f":"CONCATENATE(B102, \" - \", C102)","v":"10.1 - [Name of sub-vote]"},"10.1 - [Name of sub-vote]"]
[null,10.199999999999999,"[Name of sub-vote]","10.2 - [Name of sub-vote]"]
[null,10.3,"[Name of sub-vote]","10.3 - [Name of sub-vote]"]
[null,10.4,"[Name of sub-vote]","10.4 - [Name of sub-vote]"]
[null,10.5,"[Name of sub-vote]","10.5 - [Name of sub-vote]"]
[null,10.6,"[Name of sub-vote]","10.6 - [Name of sub-vote]"]
[null,10.7,"[Name of sub-vote]","10.7 - [Name of sub-vote]"]
[null,10.8,"[Name of sub-vote]","10.8 - [Name of sub-vote]"]
[null,10.9,"[Name of sub-vote]","10.9 - [Name of sub-vote]"]
[null,"10.10","[Name of sub-vote]","10.10 - [Name of sub-vote]"]
[null,"Vote 11","[NAME OF VOTE 11]"]
[null,11.1,"[Name of sub-vote]",{"$f":"CONCATENATE(B113, \" - \", C113)","v":"11.1 - [Name of sub-vote]"},"11.1 - [Name of sub-vote]"]
[null,11.2,"[Name of sub-vote]","11.2 - [Name of sub-vote]"]
[null,11.3,"[Name of sub-vote]","11.3 - [Name of sub-vote]"]
[null,11.4,"[Name of sub-vote]","11.4 - [Name of sub-vote]"]
[null,11.5,"[Name of sub-vote]","11.5 - [Name of sub-vote]"]
[null,11.6,"[Name of sub-vote]","11.6 - [Name of sub-vote]"]
[null,11.7,"[Name of sub-vote]","11.7 - [Name of sub-vote]"]
[null,11.8,"[Name of sub-vote]","11.8 - [Name of sub-vote]"]
[null,11.9,"[Name of sub-vote]","11.9 - [Name of sub-vote]"]
[null,"11.10","[Name of sub-vote]","11.10 - [Name of sub-vote]"]
[null,"Vote 12","[NAME OF VOTE 12]"]
[null,12.1,"[Name of sub-vote]",{"$f":"CONCATENATE(B124, \" - \", C124)","v":"12.1 - [Name of sub-vote]"},"12.1 - [Name of sub-vote]"]
[null,12.2,"[Name of sub-vote]","12.2 - [Name of sub-vote]"]
[null,12.3,"[Name of sub-vote]","12.3 - [Name of sub-vote]"]
[null,12.4,"[Name of sub-vote]","12.4 - [Name of sub-vote]"]
[null,12.5,"[Name of sub-vote]","12.5 - [Name of sub-vote]"]
[null,12.6,"[Name of sub-vote]","12.6 - [Name of sub-vote]"]
[null,12.7,"[Name of sub-vote]","12.7 - [Name of sub-vote]"]
[null,12.8,"[Name of sub-vote]","12.8 - [Name of sub-vote]"]
[null,12.9,"[Name of sub-vote]","12.9 - [Name of sub-vote]"]
[null,"12.10","[Name of sub-vote]","12.10 - [Name of sub-vote]"]
[null,"Vote 13","[NAME OF VOTE 13]"]
[null,13.1,"[Name of sub-vote]",{"$f":"CONCATENATE(B135, \" - \", C135)","v":"13.1 - [Name of sub-vote]"},"13.1 - [Name of sub-vote]"]
[null,13.2,"[Name of sub-vote]","13.2 - [Name of sub-vote]"]
[null,13.3,"[Name of sub-vote]","13.3 - [Name of sub-vote]"]
[null,13.4,"[Name of sub-vote]","13.4 - [Name of sub-vote]"]
[null,13.5,"[Name of sub-vote]","13.5 - [Name of sub-vote]"]
[null,13.6,"[Name of sub-vote]","13.6 - [Name of sub-vote]"]
[null,13.7,"[Name of sub-vote]","13.7 - [Name of sub-vote]"]
[null,13.8,"[Name of sub-vote]","13.8 - [Name of sub-vote]"]
[null,13.9,"[Name of sub-vote]","13.9 - [Name of sub-vote]"]
[null,"13.10","[Name of sub-vote]","13.10 - [Name of sub-vote]"]
[null,"Vote 14","[NAME OF VOTE 14]"]
[null,14.1,"[Name of sub-vote]",{"$f":"CONCATENATE(B146, \" - \", C146)","v":"14.1 - [Name of sub-vote]"},"14.1 - [Name of sub-vote]"]
[null,14.2,"[Name of sub-vote]","14.2 - [Name of sub-vote]"]
[null,14.3,"[Name of sub-vote]","14.3 - [Name of sub-vote]"]
[null,14.4,"[Name of sub-vote]","14.4 - [Name of sub-vote]"]
[null,14.5,"[Name of sub-vote]","14.5 - [Name of sub-vote]"]
[null,14.6,"[Name of sub-vote]","14.6 - [Name of sub-vote]"]
[null,14.7,"[Name of sub-vote]","14.7 - [Name of sub-vote]"]
[null,14.8,"[Name of sub-vote]","14.8 - [Name of sub-vote]"]
[null,14.9,"[Name of sub-vote]","14.9 - [Name of sub-vote]"]
[null,"14.10","[Name of sub-vote]","14.10 - [Name of sub-vote]"]
[null,"Vote 15","[NAME OF VOTE 15]"]
[null,15.1,"[Name of sub-vote]",{"$f":"CONCATENATE(B157, \" - \", C157)","v":"15.1 - [Name of sub-vote]"},"15.1 - [Name of sub-vote]"]
[null,15.2,"[Name of sub-vote]","15.2 - [Name of sub-vote]"]
[null,15.3,"[Name of sub-vote]","15.3 - [Name of sub-vote]"]
[null,15.4,"[Name of sub-vote]","15.4 - [Name of sub-vote]"]
[null,15.5,"[Name of sub-vote]","15.5 - [Name of sub-vote]"]
[null,15.6,"[Name of sub-vote]","15.6 - [Name of sub-vote]"]
[null,15.7,"[Name of sub-vote]","15.7 - [Name of sub-vote]"]
[null,15.8,"[Name of sub-vote]","15.8 - [Name of sub-vote]"]
[null,15.9,"[Name of sub-vote]","15.9 - [Name of sub-vote]"]
[null,"15.10","[Name of sub-vote]","15.10 - [Name of sub-vote]"]

{"sheet":"Contacts","index":5,"n_rows":140,"n_cols":3,"rows_kept":140,"cut":false,"hidden":false,"merged":[[58,2,58,3],[67,2,67,3],[76,0,76,1],[76,2,76,3],[30,2,30,3],[39,0,39,1],[39,2,39,3],[48,0,48,1],[48,2,48,3],[57,0,57,1],[57,2,57,3],[7,2,7,3],[10,2,10,3],[12,2,12,3],[13,0,13,1],[29,0,29,1],[29,2,29,3],[84,0,84,1],[84,2,84,3],[92,0,92,1],[92,2,92,3],[100,0,100,1],[100,2,100,3],[132,0,132,1],[132,2,132,3],[108,0,108,1],[108,2,108,3],[116,0,116,1],[116,2,116,3],[124,0,124,1],[124,2,124,3]]}
[{"$f":"muni&\" - \"&\" Contact Information\"","v":"KZN225 Msunduzi -  Contact Information"}]
[]
["A. GENERAL INFORMATION"]
["Municipality",{"$f":"muni","v":"KZN225 Msunduzi"},"Set name on 'Instructions' sheet"]
[]
["Grade",null,"1 Grade in terms of the Remuneration of Public Office Bearers Act."]
[]
["Province",{"$f":"IF(B4>\" \",VLOOKUP(B4,'Lookup and lists'!B28:C311,2, FALSE),\" \")","v":"KZN KWAZULU-NATAL"}]
[]
["Web Address"]
[]
["e-mail Address"]
[]
["B. CONTACT INFORMATION"]
["Postal address:"]
["P.O. Box"]
["City / Town"]
["Postal Code"]
[]
["Street address"]
["Building"]
["Street No. & Name"]
["City / Town"]
["Postal Code"]
[]
["General Contacts"]
["Telephone number"]
["Fax number"]
[]
["C. POLITICAL LEADERSHIP"]
["Speaker:",null,"Secretary/PA to the Speaker:"]
["ID Number",null,"ID Number"]
["Title",null,"Title"]
["Name",null,"Name"]
["Telephone number",null,"Telephone number"]
["Cell number",null,"Cell number"]
["Fax number",null,"Fax number"]
["E-mail address",null,"E-mail address"]
[]
["Mayor/Executive Mayor:",null,"Secretary/PA to the Mayor/Executive Mayor:"]
["ID Number",null,"ID Number"]
["Title",null,"Title"]
["Name",null,"Name"]
["Telephone number",null,"Telephone number"]
["Cell number",null,"Cell number"]
["Fax number",null,"Fax number"]
["E-mail address",null,"E-mail address"]
[]
["Deputy Mayor/Executive Mayor:",null,"Secretary/PA to the Deputy Mayor/Executive Mayor:"]
["ID Number",null,"ID Number"]
["Title",null,"Title"]
["Name",null,"Name"]
["Telephone number",null,"Telephone number"]
["Cell number",null,"Cell number"]
["Fax number",null,"Fax number"]
["E-mail address",null,"E-mail address"]
[]
["D. MANAGEMENT LEADERSHIP"]
["Municipal Manager:",null,"Secretary/PA to the Municipal Manager:"]
["ID Number",null,"ID Number"]
["Title",null,"Title"]
["Name",null,"Name"]
["Telephone number",null,"Telephone number"]
["Cell number",null,"Cell number"]
["Fax number",null,"Fax number"]
["E-mail address",null,"E-mail address"]
[]
["Chief Financial Officer",null,"Secretary/PA to the Chief Financial Officer"]
["ID Number",null,"ID Number"]
["Title",null,"Title"]
["Name","","Name"]
["Telephone number","Nelisiwe M Ngcobo","Telephone number"]
["Cell number","0333922601","Cell number"]
["Fax number",null,"Fax number"]
["E-mail address",null,"E-mail address"]
[]
["Official responsible for submitting financial information",null,"Official responsible for submitting financial information"]
["ID Number",null,"ID Number"]
["Title",null,"Title"]
["Name",null,"Name"]
["Telephone number",null,"Telephone number"]
["Cell number",null,"Cell number"]
["Fax number",null,"Fax number"]
["E-mail address",null,"E-mail address"]
["Official responsible for submitting financial information",null,"Official responsible for submitting financial information"]
["ID Number",null,"ID Number"]
["Title",null,"Title"]
["Name",null,"Name"]
["Telephone number",null,"Telephone number"]
["Cell number",null,"Cell number"]
["Fax number",null,"Fax number"]
["E-mail address",null,"E-mail address"]
["Official responsible for submitting financial information",null,"Official responsible for submitting financial information"]
["ID Number",null,"ID Number"]
["Title",null,"Title"]
["Name",null,"Name"]
["Telephone number",null,"Telephone number"]
["Cell number",null,"Cell number"]
["Fax number",null,"Fax number"]
["E-mail address",null,"E-mail address"]
["Official responsible for submitting financial information",null,"Official responsible for submitting financial information"]
["ID Number",null,"ID Number"]
["Title",null,"Title"]
["Name",null,"Name"]
["Telephone number",null,"Telephone number"]
["Cell number",null,"Cell number"]
["Fax number",null,"Fax number"]
["E-mail address",null,"E-mail address"]
["Official responsible for submitting financial information",null,"Official responsible for submitting financial information"]
["ID Number",null,"ID Number"]
["Title",null,"Title"]
["Name",null,"Name"]
["Telephone number",null,"Telephone number"]
["Cell number",null,"Cell number"]
["Fax number",null,"Fax number"]
["E-mail address",null,"E-mail address"]
["Official responsible for submitting financial information",null,"Official responsible for submitting financial information"]
["ID Number",null,"ID Number"]
["Title",null,"Title"]
["Name",null,"Name"]
["Telephone number",null,"Telephone number"]
["Cell number",null,"Cell number"]
["Fax number",null,"Fax number"]
["E-mail address",null,"E-mail address"]
["Official responsible for submitting financial information",null,"Official responsible for submitting financial information"]
["ID Number",null,"ID Number"]
["Title",null,"Title"]
["Name",null,"Name"]
["Telephone number",null,"Telephone number"]
["Cell number",null,"Cell number"]
["Fax number",null,"Fax number"]
["E-mail address",null,"E-mail address"]
["Official responsible for submitting financial information"]
["ID Number"]
["Title"]
["Name"]
["Telephone number"]
["Cell number"]
["Fax number"]
["E-mail address"]

{"sheet":"C1-Sum","index":6,"n_rows":52,"n_cols":10,"rows_kept":52,"cut":false,"hidden":false,"merged":[[54,0,54,9],[1,0,2,0],[1,2,1,9]]}
[{"$f":"muni& \" - \"&s71sum& \" - \"&date","v":"KZN225 Msunduzi - Table C1 Consolidated Monthly Budget Statement Summary - M11 May"}]
[{"$f":"desc","v":"Description"},{"$f":"Head1","v":"2022/23"},{"$f":"Head2","v":"Budget Year 2023/24"}]
[null,{"$f":"Head5","v":"Audited Outcome"},{"$f":"Head6","v":"Original Budget"},{"$f":"Head7","v":"Adjusted Budget"},{"$f":"Head38","v":"Monthly actual"},{"$f":"Head39","v":"YearTD actual"},{"$f":"Head40","v":"YearTD budget"},{"$f":"Head41","v":"YTD variance"},{"$f":"Head41","v":"YTD variance"},{"$f":"Head8","v":"Full Year Forecast"}]
["R thousands",null,null,null,null,null,null,null,"%"]
["Financial Performance"]
["Property rates",{"$f":"SUM('C4-FinPerf RE'!C22)","v":1370173436},{"$f":"SUM('C4-FinPerf RE'!D22)","v":1526985081.6338},{"$f":"SUM('C4-FinPerf RE'!E22)","v":1526985081.6338},{"$f":"SUM('C4-FinPerf RE'!F22)","v":123177547.8},{"$f":"SUM('C4-FinPerf RE'!G22)","v":1287594364.2099998},{"$f":"SUM('C4-FinPerf RE'!H22)","v":1399736324.8309834},{"$f":"F6-G6","v":-112141960.6209836},{"$f":"IF(H6=0,\"\",H6/G6)","v":-8.0116489535644944E-2},{"$f":"SUM('C4-FinPerf RE'!K22)","v":1526985081.6338}]
["Service charges",{"$f":"SUM('C4-FinPerf RE'!C7:C10)","v":3870497198},{"$f":"SUM('C4-FinPerf RE'!D7:D10)","v":5135631234.4884996},{"$f":"SUM('C4-FinPerf RE'!E7:E10)","v":4916167895.3177576},{"$f":"SUM('C4-FinPerf RE'!F7:F10)","v":-70431609.49000001},{"$f":"SUM('C4-FinPerf RE'!G7:G10)","v":3115991661.0599995},{"$f":"SUM('C4-FinPerf RE'!H7:H10)","v":4506487237.3746109},{"$f":"F7-G7","v":-1390495576.3146114},{"$f":"IF(H7=0,\"\",H7/G7)","v":-0.308554202657564},{"$f":"SUM('C4-FinPerf RE'!K7:K10)","v":4916167895.3177576}]
["Investment revenue",{"$f":"'C4-FinPerf RE'!C15","v":0},{"$f":"'C4-FinPerf RE'!D27","v":68743352.281800002},{"$f":"'C4-FinPerf RE'!E27","v":68743352.281800002},{"$f":"'C4-FinPerf RE'!F27","v":4421313.24},{"$f":"'C4-FinPerf RE'!G27","v":38841623.079999998},{"$f":"'C4-FinPerf RE'!H27","v":63014739.591650002},{"$f":"F8-G8","v":-24173116.511650003},{"$f":"IF(H8=0,\"\",H8/G8)","v":-0.3836105118944767},{"$f":"'C4-FinPerf RE'!K27","v":68743352.281800002}]
["Transfers and subsidies - Operational",{"$f":"'C4-FinPerf RE'!C15","v":0},{"$f":"'C4-FinPerf RE'!D26","v":838135150},{"$f":"'C4-FinPerf RE'!E26","v":846015625.88},{"$f":"'C4-FinPerf RE'!F26","v":7062702.5299999993},{"$f":"'C4-FinPerf RE'!G26","v":817373542.76999986},{"$f":"'C4-FinPerf RE'!H26","v":775514323.72333336},{"$f":"F9-G9","v":41859219.046666503},{"$f":"IF(H9=0,\"\",H9/G9)","v":5.3976074672219571E-2},{"$f":"'C4-FinPerf RE'!K26","v":846015625.88}]
["Other own revenue",{"$f":"+B11-SUM(B6:B9)","v":1182932540.9399996},{"$f":"+C11-SUM(C6:C9)","v":551231306.85635853},551231306.85635948,46541182.360000022,481551825.21000004,505295364.61833,{"$f":"F10-G10","v":-23743539.408329964},{"$f":"IF(H10=0,\"\",H10/G10)","v":-4.698942652336504E-2},{"$f":"+J11-SUM(J6:J9)","v":551231306.85635948}]
["Total Revenue (excluding capital transfers and contributions)",{"$f":"+'C4-FinPerf RE'!C33","v":6423603174.9399996},{"$f":"+'C4-FinPerf RE'!D33","v":8120726125.260458},{"$f":"+'C4-FinPerf RE'!E33","v":7909143261.969717},{"$f":"+'C4-FinPerf RE'!F33","v":110771136.44000001},{"$f":"+'C4-FinPerf RE'!G33","v":5741353016.329999},{"$f":"+'C4-FinPerf RE'!H33","v":7250047990.1389074},{"$f":"F11-G11","v":-1508694973.8089085},{"$f":"IF(H11=0,\"\",H11/G11)","v":-0.20809448101046329},{"$f":"+'C4-FinPerf RE'!K33","v":7909143261.969717}]
["Employee costs",{"$f":"'C4-FinPerf RE'!C35","v":1466855856},{"$f":"'C4-FinPerf RE'!D35","v":1793148355},{"$f":"'C4-FinPerf RE'!E35","v":1716571721.6399972},{"$f":"'C4-FinPerf RE'!F35","v":125140895.89000003},{"$f":"'C4-FinPerf RE'!G35","v":1433891584.5099978},{"$f":"'C4-FinPerf RE'!H35","v":1573524078.1699975},-139632493.65999961,-8.8738707972229866E-2,{"$f":"'C4-FinPerf RE'!K35","v":1716571721.6399972}]
["Remuneration of Councillors",{"$f":"'C4-FinPerf RE'!C36","v":51817506.850000001},{"$f":"'C4-FinPerf RE'!D36","v":62699934.989999995},{"$f":"'C4-FinPerf RE'!E36","v":62699934.989999995},{"$f":"'C4-FinPerf RE'!F36","v":4719825.7600000007},{"$f":"'C4-FinPerf RE'!G36","v":58539389.640000008},{"$f":"'C4-FinPerf RE'!H36","v":57474940.407499999},1064449.2325000092,1.8520232034222477E-2,{"$f":"'C4-FinPerf RE'!K36","v":62699934.989999995}]
["Depreciation and amortisation",{"$f":"'C4-FinPerf RE'!C40","v":350683902},{"$f":"'C4-FinPerf RE'!D40","v":461615984},{"$f":"'C4-FinPerf RE'!E40","v":462450178.23999989},{"$f":"'C4-FinPerf RE'!F40","v":31765602.540000003},{"$f":"'C4-FinPerf RE'!G40","v":335254486.78000003},{"$f":"'C4-FinPerf RE'!H40","v":423912663.38666654},-88658176.606666505,-0.20914255285126521,{"$f":"'C4-FinPerf RE'!K40","v":462450178.23999989}]
["Interest",{"$f":"'C4-FinPerf RE'!C41","v":143221895},{"$f":"'C4-FinPerf RE'!D41","v":40400879.723359942},{"$f":"'C4-FinPerf RE'!E41","v":40400879.723359942},{"$f":"'C4-FinPerf RE'!F41","v":1943046.92},{"$f":"'C4-FinPerf RE'!G41","v":60989928.900000006},{"$f":"'C4-FinPerf RE'!H41","v":37034139.746413276},23955789.15358673,0.64685690872316881,{"$f":"'C4-FinPerf RE'!K41","v":40400879.723359942}]
["Inventory consumed and bulk purchases",{"$f":"SUM('C4-FinPerf RE'!C37+'C4-FinPerf RE'!C38)","v":3089737285.9499998},{"$f":"SUM('C4-FinPerf RE'!D37+'C4-FinPerf RE'!D38)","v":3484629036},{"$f":"SUM('C4-FinPerf RE'!E37+'C4-FinPerf RE'!E38)","v":3592190465.6599998},{"$f":"SUM('C4-FinPerf RE'!F37+'C4-FinPerf RE'!F38)","v":277270322.81},{"$f":"SUM('C4-FinPerf RE'!G37+'C4-FinPerf RE'!G38)","v":3165096934.9099998},{"$f":"SUM('C4-FinPerf RE'!H37+'C4-FinPerf RE'!H38)","v":3292841260.1883326},-127744325.27833271,-3.8794559222398238E-2,{"$f":"SUM('C4-FinPerf RE'!K37+'C4-FinPerf RE'!K38)","v":3592190465.6599998}]
["Transfers and subsidies",{"$f":"'C4-FinPerf RE'!C43","v":29562255},{"$f":"'C4-FinPerf RE'!D43","v":51023535.286639996},{"$f":"'C4-FinPerf RE'!E43","v":14626601.039999999},{"$f":"'C4-FinPerf RE'!F43","v":4601219.6500000013},{"$f":"'C4-FinPerf RE'!G43","v":45635538.919999987},{"$f":"'C4-FinPerf RE'!H43","v":13407717.619999999},32227821.29999999,2.4036769130583755,{"$f":"'C4-FinPerf RE'!K43","v":14626601.039999999}]
["Other expenditure",{"$f":"'C4-FinPerf RE'!C48-SUM('C1-Sum'!B12:B17)","v":1090363445},{"$f":"'C4-FinPerf RE'!D48-SUM('C1-Sum'!C12:C17)","v":1811682070},{"$f":"'C4-FinPerf RE'!E48-SUM('C1-Sum'!D12:D17)","v":1675071608.8900003},{"$f":"'C4-FinPerf RE'!F48-SUM('C1-Sum'!E12:E17)","v":142482172.06999999},{"$f":"'C4-FinPerf RE'!G48-SUM('C1-Sum'!F12:F17)","v":908818619.45999908},{"$f":"'C4-FinPerf RE'!H48-SUM('C1-Sum'!G12:G17)","v":1535482308.1491671},-626663688.68916798,-0.40812172524770612,{"$f":"'C4-FinPerf RE'!K48-SUM('C1-Sum'!J12:J17)","v":1675071608.8900003}]
["Total Expenditure",{"$f":"SUM(B12:B18)","v":6222242145.7999992},7705199795,7564011390.1833572,587923085.63999999,6008226483.119997,6933677107.6680765,-925450624.54807949,-0.13347183755133438,{"$f":"SUM(J12:J18)","v":7564011390.1833572}]
["Surplus/(Deficit)",{"$f":"B11-B19","v":201361029.14000034},415526330.26045799,345131871.78635979,-477151949.19999999,-266873466.78999805,316370882.47083092,-583244349.26082897,-1.8435462350572149,{"$f":"J11-J19","v":345131871.78635979}]
["Transfers and subsidies - capital (monetary allocations)",{"$f":"'C4-FinPerf RE'!C50","v":324319270},{"$f":"'C4-FinPerf RE'!D50","v":448700054.94999999},{"$f":"'C4-FinPerf RE'!E50","v":536156203.44999993},{"$f":"'C4-FinPerf RE'!F50","v":33495287.880000003},{"$f":"'C4-FinPerf RE'!G50","v":365842655.19999999},{"$f":"'C4-FinPerf RE'!H50","v":491476519.82916665},-125633864.62916666,-0.25562536471291852,{"$f":"'C4-FinPerf RE'!K50","v":536156203.44999993}]
["Transfers and subsidies - capital (in-kind)",{"$f":"SUM('C4-FinPerf RE'!C51:C51)","v":0},{"$f":"SUM('C4-FinPerf RE'!D51:D51)","v":0},{"$f":"SUM('C4-FinPerf RE'!E51:E51)","v":0},{"$f":"SUM('C4-FinPerf RE'!F51:F51)","v":0},{"$f":"SUM('C4-FinPerf RE'!G51:G51)","v":0},{"$f":"SUM('C4-FinPerf RE'!H51:H51)","v":0},0,"",{"$f":"SUM('C4-FinPerf RE'!K51:K51)","v":0}]
["Surplus/(Deficit) after capital transfers & contributions",{"$f":"B20+B21+B22","v":525680299.14000034},864226385.21045804,881288075.23635972,-443656661.31999999,98969188.410001934,807847402.29999757,-708878213.88999557,-0.877490243667022,{"$f":"J20+J21+J22","v":881288075.23635972}]
["Share of surplus/ (deficit) of associate",{"$f":"'C4-FinPerf RE'!C59","v":0},{"$f":"'C4-FinPerf RE'!D59","v":0},{"$f":"'C4-FinPerf RE'!E59","v":0},{"$f":"'C4-FinPerf RE'!F59","v":0},{"$f":"'C4-FinPerf RE'!G59","v":0},{"$f":"'C4-FinPerf RE'!H59","v":0},0,"",{"$f":"'C4-FinPerf RE'!K59","v":0}]
["Surplus/ (Deficit) for the year",{"$f":"B23+B24","v":525680299.14000034},864226385.21045804,881288075.23635972,-443656661.31999999,98969188.410001934,807847402.29999757,-708878213.88999557,-0.877490243667022,{"$f":"J23+J24","v":881288075.23635972}]
[]
["Capital expenditure & funds sources"]
["Capital expenditure",{"$f":"'C5-Capex'!C40","v":547789828.08999991},{"$f":"'C5-Capex'!D40","v":768760054},{"$f":"'C5-Capex'!E40","v":802543953.45000005},{"$f":"'C5-Capex'!F40","v":66307801.809999987},{"$f":"'C5-Capex'!G40","v":513405543.31999993},{"$f":"'C5-Capex'!H40","v":735665290.6624999},{"$f":"F28-G28","v":-222259747.34249997},{"$f":"IF(H28=0,\"\",H28/G28)","v":-0.30212074725225246},{"$f":"'C5-Capex'!K40","v":802543953.45000005}]
["Capital transfers recognised",{"$f":"'C5-Capex'!C70","v":363329782.92999995},{"$f":"'C5-Capex'!D70","v":448700054.94999999},{"$f":"'C5-Capex'!E70","v":536156203.44999999},{"$f":"'C5-Capex'!F70","v":31114450.91},{"$f":"'C5-Capex'!G70","v":339639193.09000003},{"$f":"'C5-Capex'!H70","v":491476519.82916671},-151837326.73916668,-0.30894116120123932,{"$f":"'C5-Capex'!K70","v":536156203.44999999}]
[]
["Borrowing",{"$f":"'C5-Capex'!C72","v":0},{"$f":"'C5-Capex'!D72","v":200000000},{"$f":"'C5-Capex'!E72","v":116274950},{"$f":"'C5-Capex'!F72","v":13498379.129999999},{"$f":"'C5-Capex'!G72","v":26830247.530000001},{"$f":"'C5-Capex'!H72","v":106585370.83333333},-79755123.303333327,-0.74827457726863622,{"$f":"'C5-Capex'!K72","v":116274950}]
["Internally generated funds",{"$f":"'C5-Capex'!C73","v":184460045.16},{"$f":"'C5-Capex'!D73","v":120059999.04999995},{"$f":"'C5-Capex'!E73","v":150112799.99999994},{"$f":"'C5-Capex'!F73","v":21694971.77},{"$f":"'C5-Capex'!G73","v":146936102.70000005},{"$f":"'C5-Capex'!H73","v":137603399.99999994},9332702.7000001073,6.7823198409342436E-2,{"$f":"'C5-Capex'!K73","v":150112799.99999994}]
["Total sources of capital funds",{"$f":"+B29+B31+B32","v":547789828.08999991},768760054,802543953.45000005,66307801.810000002,513405543.32000005,735665290.6624999,-222259747.34249985,-0.3021207472522523,{"$f":"+J29+J31+J32","v":802543953.45000005}]
[]
["Financial position"]
["Total current assets",{"$f":"'C6-FinPos'!C14","v":3974179670},{"$f":"'C6-FinPos'!D14","v":2922956719.806232},{"$f":"'C6-FinPos'!E14","v":2922956719.806232},null,{"$f":"'C6-FinPos'!F14","v":4406519779.8800011},null,null,null,{"$f":"'C6-FinPos'!G14","v":2922956719.806232}]
["Total non current assets",{"$f":"'C6-FinPos'!C26","v":8372236244},{"$f":"'C6-FinPos'!D26","v":9291677655.302},{"$f":"'C6-FinPos'!E26","v":9291677655.302},null,{"$f":"'C6-FinPos'!F26","v":8029713999.6500006},null,null,null,{"$f":"'C6-FinPos'!G26","v":9291677655.302}]
["Total current liabilities",{"$f":"'C6-FinPos'!C38","v":3138566386},{"$f":"'C6-FinPos'!D38","v":1645970335.3962326},{"$f":"'C6-FinPos'!E38","v":1645970335.3962326},null,{"$f":"'C6-FinPos'!F38","v":3136650221.6700006},null,null,null,{"$f":"'C6-FinPos'!G38","v":1645970335.3962326}]
["Total non current liabilities",{"$f":"'C6-FinPos'!C44","v":658473829},{"$f":"'C6-FinPos'!D44","v":855012692.03600001},{"$f":"'C6-FinPos'!E44","v":855012692.03600001},null,{"$f":"'C6-FinPos'!F44","v":695351770.67999995},null,null,null,{"$f":"'C6-FinPos'!G44","v":855012692.03600001}]
["Community wealth/Equity",{"$f":"'C6-FinPos'!C51","v":8549375699},{"$f":"'C6-FinPos'!D51","v":9713651347.6760006},{"$f":"'C6-FinPos'!E51","v":9713651347.6760006},null,{"$f":"'C6-FinPos'!F51","v":8604231787.1799984},null,null,null,{"$f":"'C6-FinPos'!G51","v":9713651347.6760006}]
[]
["Cash flows"]
["Net cash from (used) operating",{"$f":"'C7-CFlow'!C18","v":790677633},{"$f":"'C7-CFlow'!D18","v":946378162.43000031},{"$f":"'C7-CFlow'!E18","v":946378162.43000031},{"$f":"'C7-CFlow'!F18","v":0},{"$f":"'C7-CFlow'!G18","v":0},{"$f":"'C7-CFlow'!H18","v":867513315.56083298},{"$f":"G43-F43","v":867513315.56083298},{"$f":"IF(H43=0,\"\",H43/G43)","v":1},{"$f":"'C7-CFlow'!K18","v":946378162.43000031}]
["Net cash from (used) investing",{"$f":"'C7-CFlow'!C28","v":-489265563},{"$f":"'C7-CFlow'!D28","v":-768501055},{"$f":"'C7-CFlow'!E28","v":-768501055},{"$f":"'C7-CFlow'!F28","v":0},{"$f":"'C7-CFlow'!G28","v":0},{"$f":"'C7-CFlow'!H28","v":-704459300.41666675},{"$f":"G44-F44","v":-704459300.41666675},{"$f":"IF(H44=0,\"\",H44/G44)","v":1},{"$f":"'C7-CFlow'!K28","v":-768501055}]
["Net cash from (used) financing",{"$f":"'C7-CFlow'!C37","v":-79162901},{"$f":"'C7-CFlow'!D37","v":177000000},{"$f":"'C7-CFlow'!E37","v":177000000},{"$f":"'C7-CFlow'!F37","v":0},{"$f":"'C7-CFlow'!G37","v":0},{"$f":"'C7-CFlow'!H37","v":162249999.99999997},{"$f":"G45-F45","v":162249999.99999997},{"$f":"IF(H45=0,\"\",H45/G45)","v":1},{"$f":"'C7-CFlow'!K37","v":177000000}]
["Cash/cash equivalents at the month/year end",{"$f":"'C7-CFlow'!C41","v":511402009},{"$f":"'C7-CFlow'!D41","v":766879964.69500041},{"$f":"'C7-CFlow'!E41","v":766879964.69500041},{"$f":"'C7-CFlow'!F41","v":0},{"$f":"'C7-CFlow'!G41","v":0},{"$f":"'C7-CFlow'!H41","v":531305443.77666628},{"$f":"G46-F46","v":531305443.77666628},{"$f":"IF(H46=0,\"\",H46/G46)","v":1},{"$f":"'C7-CFlow'!K41","v":354877107.43000031}]
[]
["Debtors & creditors analysis",{"$f":"'SC3'!C3","v":"0-30 Days"},{"$f":"'SC3'!D3","v":"31-60 Days"},{"$f":"'SC3'!E3","v":"61-90 Days"},{"$f":"'SC3'!F3","v":"91-120 Days"},{"$f":"'SC3'!G3","v":"121-150 Dys"},{"$f":"'SC3'!H3","v":"151-180 Dys"},{"$f":"'SC3'!I3","v":"181 Dys-1 Yr"},{"$f":"'SC3'!J3","v":"Over 1Yr"},"Total"]
[{"$f":"LEFT('SC3'!A4,20)","v":"Debtors Age Analysis"}]
[{"$f":"'SC3'!A14","v":"Total By Income Source"},{"$f":"'SC3'!C14","v":491289982.10000002},{"$f":"'SC3'!D14","v":138617529.86000001},{"$f":"'SC3'!E14","v":147824298.43000001},{"$f":"'SC3'!F14","v":142665023.90000001},{"$f":"'SC3'!G14","v":134407579.11000001},{"$f":"'SC3'!H14","v":126324045.57000001},{"$f":"'SC3'!I14","v":716122038.13000011},{"$f":"'SC3'!J14","v":5121379629.79},{"$f":"'SC3'!K14","v":7018630126.8899994}]
[{"$f":"LEFT('SC4'!A5,22)","v":"Creditors Age Analysis"}]
["Total Creditors",{"$f":"'SC4'!C15","v":622261744.18000007},{"$f":"'SC4'!D15","v":-32824119.73},{"$f":"'SC4'!E15","v":17341213.129999999},{"$f":"'SC4'!F15","v":12627644.640000001},{"$f":"'SC4'!G15","v":1506990161.75},{"$f":"'SC4'!H15","v":0},{"$f":"'SC4'!I15","v":0},{"$f":"'SC4'!J15","v":0},{"$f":"'SC4'!K15","v":2126396643.97}]

{"sheet":"C2-FinPerf SC","index":7,"n_rows":55,"n_cols":11,"rows_kept":55,"cut":false,"hidden":false,"merged":[[1,1,2,1],[1,0,2,0],[0,0,0,10],[54,0,54,10]]}
[{"$f":"muni& \" - \"&S71A& \" - \"&date","v":"KZN225 Msunduzi - Table C2 Consolidated Monthly Budget Statement - Financial Performance (functional classification)  - M11 May"}]
[{"$f":"desc","v":"Description"},{"$f":"head27","v":"Ref"},{"$f":"Head1","v":"2022/23"},{"$f":"Head2","v":"Budget Year 2023/24"}]
[null,null,{"$f":"Head5","v":"Audited Outcome"},{"$f":"Head6","v":"Original Budget"},{"$f":"Head7","v":"Adjusted Budget"},{"$f":"Head38","v":"Monthly actual"},{"$f":"Head39","v":"YearTD actual"},{"$f":"Head40","v":"YearTD budget"},{"$f":"Head41","v":"YTD variance"},{"$f":"Head41","v":"YTD variance"},{"$f":"Head8","v":"Full Year Forecast"}]
["R thousands",1,null,null,null,null,null,null,null,"%"]
["Revenue - Functional"]
["Governance and administration",null,{"$f":"SUM(C7:C9)","v":1955757201.9599998},2375779978.8053889,2531073523.2400002,140372457.29000005,1942171472.0699997,2320150729.6366668,{"$f":"G6-H6","v":-377979257.56666708},{"$f":"IF(I6=0,\"\",I6/H6)","v":-0.16291150947156707},{"$f":"SUM(K7:K9)","v":2531073523.2400002}]
["Executive and council",null,{"$f":"'C2C'!C7","v":5213268.17},{"$f":"'C2C'!D7","v":4979000},{"$f":"'C2C'!E7","v":4701000.0000000009},{"$f":"'C2C'!F7","v":4581.22},{"$f":"'C2C'!G7","v":3555760.0100000002},{"$f":"'C2C'!H7","v":4309250.0000000009},-753489.99000000069,{"$f":"IF(I7=0,\"\",I7/H7)","v":-0.17485409061901735},{"$f":"'C2C'!K7","v":4701000.0000000009}]
["Finance and administration",null,{"$f":"'C2C'!C10","v":1950543933.7899997},{"$f":"'C2C'!D10","v":2370800978.8053889},{"$f":"'C2C'!E10","v":2526372523.2400002},{"$f":"'C2C'!F10","v":140367876.07000005},{"$f":"'C2C'!G10","v":1938615712.0599997},{"$f":"'C2C'!H10","v":2315841479.6366668},-377225767.57666707,-0.16288928706633676,{"$f":"'C2C'!K10","v":2526372523.2400002}]
["Internal audit",null,{"$f":"'C2C'!C24","v":0},{"$f":"'C2C'!D24","v":0},{"$f":"'C2C'!E24","v":0},{"$f":"'C2C'!F24","v":0},{"$f":"'C2C'!G24","v":0},{"$f":"'C2C'!H24","v":0},0,"",{"$f":"'C2C'!K24","v":0}]
["Community and public safety",null,{"$f":"SUM(C11:C15)","v":142629089.91999999},338866615.01203102,326589903.37000406,22044574.369999997,154757615.74999994,299374078.0891704,-144616462.33917046,-0.48306273964072322,{"$f":"SUM(K11:K15)","v":326589903.37000406}]
["Community and social services",null,{"$f":"'C2C'!C27","v":61498683.100000009},{"$f":"'C2C'!D27","v":276753844.24993801},{"$f":"'C2C'!E27","v":79864674.560000107},{"$f":"'C2C'!F27","v":7281215.4400000004},{"$f":"'C2C'!G27","v":49046959.159999996},{"$f":"'C2C'!H27","v":73209285.01333344},-24162325.853333443,-0.33004455444323511,{"$f":"'C2C'!K27","v":79864674.560000107}]
["Sport and recreation",null,{"$f":"'C2C'!C49","v":588753.10000000009},{"$f":"'C2C'!D49","v":21223330.408260003},{"$f":"'C2C'!E49","v":40912790.408260003},{"$f":"'C2C'!F49","v":64301.880000000005},{"$f":"'C2C'!G49","v":2340567.4300000002},{"$f":"'C2C'!H49","v":37503391.20757167},-35162823.777571671,-0.93759051236072066,{"$f":"'C2C'!K49","v":40912790.408260003}]
["Public safety",null,{"$f":"'C2C'!C55","v":24640408.620000001},{"$f":"'C2C'!D55","v":8568779.0717440005},{"$f":"'C2C'!E55","v":8568779.0717440005},{"$f":"'C2C'!F55","v":4177043.3899999997},{"$f":"'C2C'!G55","v":22322805.43},{"$f":"'C2C'!H55","v":7854714.1490986673},14468091.280901331,1.8419628017350005,{"$f":"'C2C'!K55","v":8568779.0717440005}]
["Housing",null,{"$f":"'C2C'!C64","v":55901245.099999987},{"$f":"'C2C'!D64","v":32320661.282088995},{"$f":"'C2C'!E64","v":197243659.32999998},{"$f":"'C2C'!F64","v":10522013.659999998},{"$f":"'C2C'!G64","v":81047283.729999959},{"$f":"'C2C'!H64","v":180806687.71916664},-99759403.989166677,-0.55174620611442993,{"$f":"'C2C'!K64","v":197243659.32999998}]
["Health",null,{"$f":"'C2C'!C67","v":0},{"$f":"'C2C'!D67","v":0},{"$f":"'C2C'!E67","v":0},{"$f":"'C2C'!F67","v":0},{"$f":"'C2C'!G67","v":0},{"$f":"'C2C'!H67","v":0},0,"",{"$f":"'C2C'!K67","v":0}]
["Economic and environmental services",null,{"$f":"SUM(C17:C19)","v":200051132.51000002},55600947.447282426,197768889.92609963,20274964.93,155987481.76000002,181288149.09892467,-25300667.338924646,-0.13956051437823808,{"$f":"SUM(K17:K19)","v":197768889.92609963}]
["Planning and development",null,{"$f":"'C2C'!C76","v":152414516.51000002},{"$f":"'C2C'!D76","v":47684582.161182426},{"$f":"'C2C'!E76","v":137252524.63999963},{"$f":"'C2C'!F76","v":11072590.989999998},{"$f":"'C2C'!G76","v":111704088.05000001},{"$f":"'C2C'!H76","v":125814814.253333},-14110726.20333299,-0.11215472746254265,{"$f":"'C2C'!K76","v":137252524.63999963}]
["Road transport",null,{"$f":"'C2C'!C87","v":47241673.420000002},{"$f":"'C2C'!D87","v":0},{"$f":"'C2C'!E87","v":52600000},{"$f":"'C2C'!F87","v":9157605.2300000004},{"$f":"'C2C'!G87","v":43615897.030000001},{"$f":"'C2C'!H87","v":48216666.666666664},-4600769.636666663,-9.5418658209471069E-2,{"$f":"'C2C'!K87","v":52600000}]
["Environmental protection",null,{"$f":"'C2C'!C92","v":394942.58},{"$f":"'C2C'!D92","v":7916365.2861000011},{"$f":"'C2C'!E92","v":7916365.2861000011},{"$f":"'C2C'!F92","v":44768.71},{"$f":"'C2C'!G92","v":667496.67999999993},{"$f":"'C2C'!H92","v":7256668.1789250011},-6589171.4989250014,-0.9080160945020801,{"$f":"'C2C'!K92","v":7916365.2861000011}]
["Trading services",null,{"$f":"SUM(C21:C24)","v":4410211201.3800001},{"$f":"SUM(D21:D24)","v":5698134020.4703426},5275471311.9636583,-41428614.810000122,3818810814.8100023,4835848702.6333532,-1017037887.8233509,-0.21031218103856819,{"$f":"SUM(K21:K24)","v":5275471311.9636583}]
["Energy sources",null,{"$f":"'C2C'!C100","v":2724539631},{"$f":"'C2C'!D100","v":4028755845.6152434},{"$f":"'C2C'!E100","v":3712970414.2736578},{"$f":"'C2C'!F100","v":-91230978.990000114},{"$f":"'C2C'!G100","v":2169752049.4000025},{"$f":"'C2C'!H100","v":3403556213.0841866},{"$f":"G21-H21","v":-1233804163.6841841},-0.36250441786185539,{"$f":"'C2C'!K100","v":3712970414.2736578}]
["Water management",null,{"$f":"'C2C'!C104","v":1249069243.4500003},{"$f":"'C2C'!D104","v":1300958055.8464499},{"$f":"'C2C'!E104","v":1127612549.4100001},{"$f":"'C2C'!F104","v":34874146.089999996},{"$f":"'C2C'!G104","v":1198955761.6599998},{"$f":"'C2C'!H104","v":1033644836.9591666},{"$f":"G22-H22","v":165310924.7008332},0.15993010247809489,{"$f":"'C2C'!K104","v":1127612549.4100001}]
["Waste water management",null,{"$f":"'C2C'!C108","v":286349072.06000006},{"$f":"'C2C'!D108","v":209646015.87575004},{"$f":"'C2C'!E108","v":284013369.56},{"$f":"'C2C'!F108","v":7522820.790000001},{"$f":"'C2C'!G108","v":299501670.38},{"$f":"'C2C'!H108","v":260345588.76333332},{"$f":"G23-H23","v":39156081.616666675},0.15040040356612855,{"$f":"'C2C'!K108","v":284013369.56}]
["Waste management",null,{"$f":"'C2C'!C113","v":150253254.87},{"$f":"'C2C'!D113","v":158774103.1329},{"$f":"'C2C'!E113","v":150874978.72},{"$f":"'C2C'!F113","v":7405397.3000000007},{"$f":"'C2C'!G113","v":150601333.37},{"$f":"'C2C'!H113","v":138302063.82666665},{"$f":"G24-H24","v":12299269.543333352},8.8930484499117599E-2,{"$f":"'C2C'!K113","v":150874978.72}]
["Other",4,{"$f":"'C2C'!C118","v":39273819.169999994},{"$f":"'C2C'!D118","v":101044618.4754146},{"$f":"'C2C'!E118","v":114395836.91995399},{"$f":"'C2C'!F118","v":3003042.54},{"$f":"'C2C'!G118","v":35468287.140000001},{"$f":"'C2C'!H118","v":104862850.50995781},{"$f":"G25-H25","v":-69394563.369957805},-0.66176499143867995,{"$f":"'C2C'!K118","v":114395836.91995399}]
["Total Revenue - Functional",2,{"$f":"C6+C10+C16+C20+C25","v":6747922444.9400005},{"$f":"D6+D10+D16+D20+D25","v":8569426180.2104588},8445299465.4197168,144266424.31999993,6107195671.5300026,7741524509.9680729,-1634328838.4380708,-0.21111201499571444,{"$f":"K6+K10+K16+K20+K25","v":8445299465.4197168}]
[]
["Expenditure - Functional"]
["Governance and administration",null,{"$f":"SUM(C30:C32)","v":1085322316.7400002},1480552759.1052101,1740730564.9199998,124118561.78,984952092.83999991,1595669684.51,{"$f":"G29-H29","v":-610717591.67000008},{"$f":"IF(I29=0,\"\",I29/H29)","v":-0.38273434508316795},{"$f":"SUM(K30:K32)","v":1740730564.9199998}]
["Executive and council",null,{"$f":"'C2C'!C129","v":115687006.42999995},{"$f":"'C2C'!D129","v":258320031.05366999},{"$f":"'C2C'!E129","v":150269914},{"$f":"'C2C'!F129","v":16417950.310000006},{"$f":"'C2C'!G129","v":137328642.64000002},{"$f":"'C2C'!H129","v":137747421.16666669},-418778.52666667104,{"$f":"IF(I30=0,\"\",I30/H30)","v":-3.0401914106251934E-3},{"$f":"'C2C'!K129","v":150269914}]
["Finance and administration",null,{"$f":"'C2C'!C132","v":950234661.94000018},{"$f":"'C2C'!D132","v":1193777692.58764},{"$f":"'C2C'!E132","v":1560312497.4399998},{"$f":"'C2C'!F132","v":105066323.28},{"$f":"'C2C'!G132","v":830411732.81999993},{"$f":"'C2C'!H132","v":1430286455.9866667},-599874723.16666675,-0.41940879790604607,{"$f":"'C2C'!K132","v":1560312497.4399998}]
["Internal audit",null,{"$f":"'C2C'!C146","v":19400648.370000005},{"$f":"'C2C'!D146","v":28455035.463900004},{"$f":"'C2C'!E146","v":30148153.479999993},{"$f":"'C2C'!F146","v":2634288.19},{"$f":"'C2C'!G146","v":17211717.379999999},{"$f":"'C2C'!H146","v":27635807.356666658},-10424089.976666659,-0.3771950586474192,{"$f":"'C2C'!K146","v":30148153.479999993}]
["Community and public safety",null,{"$f":"SUM(C34:C38)","v":624011514.17999995},537195647.38537049,640809790.87000012,47164931.119999997,536957643.00999999,587408974.96416664,-50451331.954166651,-8.5887914731374859E-2,{"$f":"SUM(K34:K38)","v":640809790.87000012}]
["Community and social services",null,{"$f":"'C2C'!C149","v":147223223.92999995},{"$f":"'C2C'!D149","v":135893001.57432997},{"$f":"'C2C'!E149","v":149462212.81999999},{"$f":"'C2C'!F149","v":12479943.399999999},{"$f":"'C2C'!G149","v":139048644.15000001},{"$f":"'C2C'!H149","v":137007028.41833332},2041615.7316666842,1.4901540127071972E-2,{"$f":"'C2C'!K149","v":149462212.81999999}]
["Sport and recreation",null,{"$f":"'C2C'!C171","v":140506827.45000005},{"$f":"'C2C'!D171","v":130424689.03570996},{"$f":"'C2C'!E171","v":134183742.56000005},{"$f":"'C2C'!F171","v":12736345.380000005},{"$f":"'C2C'!G171","v":134054301.42000006},{"$f":"'C2C'!H171","v":123001764.01333338},11052537.406666681,8.9856739009601422E-2,{"$f":"'C2C'!K171","v":134183742.56000005}]
["Public safety",null,{"$f":"'C2C'!C177","v":232287900.66999999},{"$f":"'C2C'!D177","v":222097496.01233053},{"$f":"'C2C'!E177","v":259339347.92000002},{"$f":"'C2C'!F177","v":14946010.579999994},{"$f":"'C2C'!G177","v":185421982.88999996},{"$f":"'C2C'!H177","v":237727735.5933333},-52305752.703333348,-0.22002377035555368,{"$f":"'C2C'!K177","v":259339347.92000002}]
["Housing",null,{"$f":"'C2C'!C186","v":94434776.87999998},{"$f":"'C2C'!D186","v":35263319.4102},{"$f":"'C2C'!E186","v":87641516.190000042},{"$f":"'C2C'!F186","v":6394712.4600000018},{"$f":"'C2C'!G186","v":69165804.449999973},{"$f":"'C2C'!H186","v":80338056.507500038},-11172252.057500064,-0.13906550075003454,{"$f":"'C2C'!K186","v":87641516.190000042}]
["Health",null,{"$f":"'C2C'!C189","v":9558785.25},{"$f":"'C2C'!D189","v":13517141.352799997},{"$f":"'C2C'!E189","v":10182971.379999999},{"$f":"'C2C'!F189","v":607919.30000000005},{"$f":"'C2C'!G189","v":9266910.0999999978},{"$f":"'C2C'!H189","v":9334390.4316666648},-67480.331666667014,-7.2292167507523397E-3,{"$f":"'C2C'!K189","v":10182971.379999999}]
["Economic and environmental services",null,{"$f":"SUM(C40:C42)","v":378225313.45000005},513621030.73583996,490950688.08999979,43188503.289999992,381483135.1500001,450038130.74916649,-68554995.599166393,-0.15233152685316845,{"$f":"SUM(K40:K42)","v":490950688.08999979}]
["Planning and development",null,{"$f":"'C2C'!C198","v":93765700.129999995},{"$f":"'C2C'!D198","v":84862819.172940001},{"$f":"'C2C'!E198","v":104058486.33999994},{"$f":"'C2C'!F198","v":11778687.599999998},{"$f":"'C2C'!G198","v":82004672.36999999},{"$f":"'C2C'!H198","v":95386945.811666623},-13382273.441666633,-0.14029460035431671,{"$f":"'C2C'!K198","v":104058486.33999994}]
["Road transport",null,{"$f":"'C2C'!C209","v":259798778.12000006},{"$f":"'C2C'!D209","v":402475671.16714996},{"$f":"'C2C'!E209","v":361406895.76999986},{"$f":"'C2C'!F209","v":29285544.529999997},{"$f":"'C2C'!G209","v":275503426.26000011},{"$f":"'C2C'!H209","v":331289654.4558332},-55786228.195833087,-0.16839109656915163,{"$f":"'C2C'!K209","v":361406895.76999986}]
["Environmental protection",null,{"$f":"'C2C'!C214","v":24660835.199999999},{"$f":"'C2C'!D214","v":26282540.395750005},{"$f":"'C2C'!E214","v":25485305.979999997},{"$f":"'C2C'!F214","v":2124271.1599999997},{"$f":"'C2C'!G214","v":23975036.52},{"$f":"'C2C'!H214","v":23361530.481666662},613506.03833333775,2.6261380384080425E-2,{"$f":"'C2C'!K214","v":25485305.979999997}]
["Trading services",null,{"$f":"SUM(C44:C47)","v":4061495012.9100037},{"$f":"SUM(D44:D47)","v":5109852270.9189796},4628143773.8500004,367399100.21999991,4040066218.1900029,4242465126.0291672,-202398907.83916414,-4.7707854237237786E-2,{"$f":"SUM(K44:K47)","v":4628143773.8500004}]
["Energy sources",null,{"$f":"'C2C'!C222","v":2621122229.710001},{"$f":"'C2C'!D222","v":3289791559.6896291},{"$f":"'C2C'!E222","v":3113161655.1600013},{"$f":"'C2C'!F222","v":236179941.34999996},{"$f":"'C2C'!G222","v":2780945943.7200031},{"$f":"'C2C'!H222","v":2853731517.230001},-72785573.509997845,-2.5505403388699926E-2,{"$f":"'C2C'!K222","v":3113161655.1600013}]
["Water management",null,{"$f":"'C2C'!C226","v":952915577.47000265},{"$f":"'C2C'!D226","v":1293156973.5049391},{"$f":"'C2C'!E226","v":997172145.62999964},{"$f":"'C2C'!F226","v":92509825.529999971},{"$f":"'C2C'!G226","v":817992947.91999996},{"$f":"'C2C'!H226","v":914074466.82749963},-96081518.907499671,-0.10511344796772644,{"$f":"'C2C'!K226","v":997172145.62999964}]
["Waste water management",null,{"$f":"'C2C'!C230","v":348153877.7700001},{"$f":"'C2C'!D230","v":399300023.23709154},{"$f":"'C2C'!E230","v":368517895.44},{"$f":"'C2C'!F230","v":28345919.709999997},{"$f":"'C2C'!G230","v":316674692.38999999},{"$f":"'C2C'!H230","v":337808070.81999993},-21133378.429999948,-6.2560312365244841E-2,{"$f":"'C2C'!K230","v":368517895.44}]
["Waste management",null,{"$f":"'C2C'!C235","v":139303327.95999998},{"$f":"'C2C'!D235","v":127603714.48732021},{"$f":"'C2C'!E235","v":149292077.62000003},{"$f":"'C2C'!F235","v":10363413.629999997},{"$f":"'C2C'!G235","v":124452634.16000001},{"$f":"'C2C'!H235","v":136851071.1516667},-12398436.99166669,-9.0598026652827485E-2,{"$f":"'C2C'!K235","v":149292077.62000003}]
["Other",null,{"$f":"'C2C'!C240","v":73187988.519995749},{"$f":"'C2C'!D240","v":63978086.854600012},{"$f":"'C2C'!E240","v":63376572.453357965},{"$f":"'C2C'!F240","v":6051989.2300000004},{"$f":"'C2C'!G240","v":64767393.929999992},{"$f":"'C2C'!H240","v":58095191.415578142},6672202.5144218504,0.11484947982515312,{"$f":"'C2C'!K240","v":63376572.453357965}]
["Total Expenditure - Functional",3,{"$f":"C29+C33+C39+C43+C48","v":6222242145.7999992},{"$f":"D29+D33+D39+D43+D48","v":7705199795},7564011390.1833572,587923085.63999987,6008226483.1200027,6933677107.6680784,-925450624.54807544,-0.13347183755133377,{"$f":"K29+K33+K39+K43+K48","v":7564011390.1833572}]
["Surplus/ (Deficit) for the year",null,{"$f":"C26-C49","v":525680299.1400013},864226385.21045876,881288075.2363596,-443656661.31999993,98969188.409999847,807847402.29999447,{"$f":"I26-I49","v":-708878213.88999534},{"$f":"IF(I50=0,\"\",I50/H50)","v":-0.87749024366702499},{"$f":"K26-K49","v":881288075.2363596}]
[{"$f":"head27a","v":"References"}]
["1. Government Finance Statistics Functions and Sub-functions are standardised to assist the compilation of national and international accounts for comparison purposes"]
["2. Total Revenue by functional classification must reconcile to Total Operating Revenue shown in the Financial Performance Statement"]
["3. Total Expenditure by functional classification must reconcile to total operating expenditure shown in 'Financial Performance Statement'"]
["4. All amounts must be classified under a functional classification (modified GFS). The GFS function 'Other' is only for Abbatoirs, Air Transport, Licensing and Regulation, Markets and Tourism - and if used must be supported by footnotes. Nothing else may be placed under 'Other'. Assign associate share to relevant classification"]

{"sheet":"C2C","index":8,"n_rows":257,"n_cols":11,"rows_kept":257,"cut":false,"hidden":false,"merged":[[252,0,252,10],[0,0,0,10],[1,0,2,0],[1,1,2,1]]}
[{"$f":"muni& \" - \"&S71A& \" - \"&date","v":"KZN225 Msunduzi - Table C2 Consolidated Monthly Budget Statement - Financial Performance (functional classification)  - M11 May"}]
[{"$f":"desc","v":"Description"},{"$f":"head27","v":"Ref"},{"$f":"Head1","v":"2022/23"},{"$f":"Head2","v":"Budget Year 2023/24"}]
[null,null,{"$f":"Head5","v":"Audited Outcome"},{"$f":"Head6","v":"Original Budget"},{"$f":"Head7","v":"Adjusted Budget"},{"$f":"Head38","v":"Monthly actual"},{"$f":"Head39","v":"YearTD actual"},"YearTD budget",{"$f":"Head41","v":"YTD variance"},{"$f":"Head41","v":"YTD variance"},{"$f":"Head8","v":"Full Year Forecast"}]
["R thousands",1,null,null,null,null,null,null,null,"%"]
["Revenue - Functional"]
["Municipal governance and administration",null,{"$f":"C7+C10+C24","v":1955757201.9599998},2375779978.8053889,2531073523.2400002,140372457.29000005,1942171472.0699997,2320150729.6366668,{"$f":"G6-H6","v":-377979257.56666708},{"$f":"IF(I6=0,\"\",I6/H6)","v":-0.16291150947156707},{"$f":"K7+K10+K24","v":2531073523.2400002}]
["Executive and council",null,{"$f":"SUM(C8:C9)","v":5213268.17},{"$f":"SUM(D8:D9)","v":4979000},4701000.0000000009,4581.22,3555760.0100000002,4309250.0000000009,{"$f":"G7-H7","v":-753489.99000000069},{"$f":"IF(I7=0,\"\",I7/H7)","v":-0.17485409061901735},4701000.0000000009]
["Mayor and Council",null,-14822.46,0,0,0,0,{"$f":"E8/12*11","v":0},0,"",{"$f":"E8","v":0}]
["Municipal Manager, Town Secretary and Chief Executive",null,5228090.63,4979000,4701000.0000000009,4581.22,3555760.0100000002,{"$f":"E9/12*11","v":4309250.0000000009},-753489.99000000069,-0.17485409061901735,{"$f":"E9","v":4701000.0000000009}]
["Finance and administration",null,{"$f":"SUM(C11:C23)","v":1950543933.7899997},2370800978.8053889,2526372523.2400002,140367876.07000005,1938615712.0599997,2315841479.6366668,-377225767.57666707,-0.16288928706633676,{"$f":"SUM(K11:K23)","v":2526372523.2400002}]
["Administrative and Corporate Support",null,-201.25,607186.86479999998,0,0,0,{"$f":"E11/12*11","v":0},0,"",{"$f":"E11","v":0}]
["Asset Management",null,3029221.11,13390566.76685,13390566.770000001,0,28685.93,12274686.205833334,-12246000.275833335,-0.99766300095016958,13390566.770000001]
["Finance",null,1928898482.23,2305482256.4584389,2462261850.7800002,138597544.47000006,1913038836.3299997,2257073363.2150002,-344034526.88500047,-0.15242505294331857,2462261850.7800002]
["Fleet Management",null,0,0,0,0,0,0,0,"",0]
["Human Resources",null,8836069.3000000007,12513790.277449999,11912927.260000002,1712542.5,7448152.3199999994,10920183.321666669,-3472031.0016666697,-0.31794621934394035,11912927.260000002]
["Information Technology",null,-34.149999999994634,2472.4264499999999,2472.4299999999998,0,417.36,2266.3941666666665,-1849.0341666666664,-0.81584844942755974,2472.4299999999998]
["Legal Services",null,47.550000000000068,315314.26940000005,315314.27,0,428337.14,289038.08083333331,139299.0591666667,0.48194016084333907,315314.27]
["Marketing, Customer Relations, Publicity and Media Co-ordination",null,0,0,0,0,0,0,0,"",0]
["Property Services",null,9623664.6699999999,38156452.557500005,38156452.549999997,56004.150000000009,17631167.259999994,34976748.170833334,-17345580.91083334,-0.49591748284071757,38156452.549999997]
["Risk Management",null,0,0,0,0,0,0,0,"",0]
["Security Services",null,0,0,0,0,0,0,0,"",0]
["Supply Chain Management ",null,156684.32999999999,332939.18450000003,332939.18,1784.95,40115.720000000008,305194.24833333335,-265078.52833333332,-0.8685567627205556,332939.18]
["Valuation Service",null,0,0,0,0,0,0,0,"",0]
["Internal audit",null,{"$f":"SUM(C25:C25)","v":0},0,0,0,0,0,0,"",{"$f":"SUM(K25:K25)","v":0}]
["Governance Function",null,null,null,null,null,null,{"$f":"E25/12*11","v":0},0,"",{"$f":"E25","v":0}]
["Community and public safety",null,{"$f":"C27+C49+C55+C64+C67","v":142629089.91999999},{"$f":"D27+D49+D55+D64+D67","v":338866615.01203102},326589903.37000406,22044574.369999997,154757615.74999994,299374078.0891704,-144616462.33917046,-0.48306273964072322,326589903.37000406]
["Community and social services",null,{"$f":"SUM(C28:C48)","v":61498683.100000009},276753844.24993801,79864674.560000107,7281215.4400000004,49046959.159999996,73209285.01333344,-24162325.853333443,-0.33004455444323511,{"$f":"SUM(K28:K48)","v":79864674.560000107}]
["Aged Care",null,0,0,0,null,null,null,0,"",{"$f":"E28","v":0}]
["Agricultural",null,0,0,0,null,null,null,0,"",0]
["Animal Care and Diseases",null,0,0,0,null,null,null,0,"",0]
["Cemeteries, Funeral Parlours and Crematoriums",null,11624350.66,16617370.718400002,16617370.719999999,298091.96000000002,13753323.91,{"$f":"E31/12*11","v":15232589.826666666},-1479265.916666666,-9.7111911598710229E-2,16617370.719999999]
["Child Care Facilities",null,0,0,0,0,0,null,0,"",0]
["Community Halls and Facilities",null,33263673.610000007,245427473.62153801,47103520.469999999,131550.63,15773796.039999994,{"$f":"E33/12*11","v":43178227.097500004},-27404431.057500012,-0.6346817111230284,47103520.469999999]
["Consumer Protection",null,0,0,0,null,null,null,0,"",0]
["Cultural Matters",null,0,0,0,null,null,null,0,"",0]
["Disaster Management",null,0,0,0,null,null,null,0,"",0]
["Education",null,0,0,0,null,null,null,0,"",0]
["Indigenous and Customary Law",null,0,0,0,null,null,null,0,"",0]
["Industrial Promotion",null,0,0,0,null,null,null,0,"",0]
["Language Policy",null,0,0,0,null,null,null,0,"",0]
["Libraries and Archives",null,16171964.220000001,13537999.91,-119600.61999988556,6825512.6900000004,19350075.640000001,{"$f":"E41/12*11","v":-109633.90166656177},19459709.541666564,-177.49719061217863,-119600.61999988556]
["Literacy Programmes",null,0,0,0,null,null,null,0,"",0]
["Media Services",null,0,0,0,null,null,null,0,"",0]
["Museums and Art Galleries",null,438694.61,1171000,16263383.99,26060.16,169763.57,{"$f":"E44/12*11","v":14908101.990833335},-14738338.420833334,-0.98861266376468415,16263383.99]
["Population Development",null,0,0,0,null,null,null,0,"",0]
["Provincial Cultural Matters",null,0,0,0,null,null,null,0,"",0]
["Theatres",null,0,0,0,null,null,null,0,"",0]
["Zoo's",null,0,0,0,null,null,null,0,"",0]
["Sport and recreation",null,{"$f":"SUM(C50:C54)","v":588753.10000000009},{"$f":"SUM(D50:D54)","v":21223330.408260003},40912790.408260003,64301.880000000005,2340567.4300000002,37503391.20757167,-35162823.777571671,-0.93759051236072066,40912790.408260003]
["Beaches and Jetties ",null,0,0,null,null,null,null,0,"",{"$f":"E50","v":0}]
["Casinos, Racing, Gambling, Wagering",null,0,0,null,null,null,null,0,"",0]
["Community Parks (including Nurseries)",null,0,0,null,null,null,null,0,"",0]
["Recreational Facilities",null,588753.10000000009,21223330.408260003,21223330.408260003,23051.88,489080.36999999994,{"$f":"E53/12*11","v":19454719.540905003},-18965639.170905001,-0.97486057976977392,21223330.408260003]
["Sports Grounds and Stadiums",null,0,0,19689460,41250,1851487.06,18048671.666666664,-16197184.606666664,-0.89741699033622324,19689460]
["Public safety",null,{"$f":"SUM(C56:C63)","v":24640408.620000001},{"$f":"SUM(D56:D63)","v":8568779.0717440005},8568779.0717440005,4177043.3899999997,22322805.43,7854714.1490986673,14468091.280901331,1.8419628017350005,8568779.0717440005]
["Civil Defence",null,-19.139999999999873,0,0,null,null,null,0,"",{"$f":"E56","v":0}]
["Cleansing",null,0,0,0,null,null,null,0,"",0]
["Control of Public Nuisances",null,0,0,0,null,null,null,{"$f":"G58-H58","v":0},{"$f":"IF(I58=0,\"\",I58/H58)","v":""},0]
["Fencing and Fences ",null,0,0,0,null,null,null,0,"",0]
["Fire Fighting and Protection",null,370743.01,397088.87290000002,397088.87290000002,18702.3,197809.57,{"$f":"E60/12*11","v":363998.1334916667},-166188.56349166669,-0.4565643287714039,397088.87290000002]
["Licensing and Control of Animals",null,0,0,0,0,0,null,{"$f":"G61-H61","v":0},{"$f":"IF(I61=0,\"\",I61/H61)","v":""},0]
["Police Forces, Traffic and Street Parking Control",null,24269684.75,8171690.1988439998,8171690.1988439998,4158341.09,22124995.859999999,{"$f":"E62/12*11","v":7490716.0156070003},{"$f":"G62-H62","v":14634279.844393},{"$f":"IF(I62=0,\"\",I62/H62)","v":1.9536556737569941},8171690.1988439998]
["Pounds",null,0,0,0,null,null,null,0,"",0]
["Housing",null,{"$f":"SUM(C65:C66)","v":55901245.099999987},32320661.282088995,197243659.32999998,10522013.659999998,81047283.729999959,180806687.71916664,{"$f":"G64-H64","v":-99759403.989166677},{"$f":"IF(I64=0,\"\",I64/H64)","v":-0.55174620611442993},{"$f":"SUM(K65:K66)","v":197243659.32999998}]
["Housing",null,55901245.099999987,32320661.282088995,197243659.32999998,10522013.659999998,81047283.729999959,{"$f":"E65/12*11","v":180806687.71916664},{"$f":"G65-H65","v":-99759403.989166677},{"$f":"IF(I65=0,\"\",I65/H65)","v":-0.55174620611442993},{"$f":"E65","v":197243659.32999998}]
["Informal Settlements",null,0,0,0,null,null,null,{"$f":"G66-H66","v":0},{"$f":"IF(I66=0,\"\",I66/H66)","v":""}]
["Health",null,{"$f":"SUM(C68:C74)","v":0},0,0,0,0,0,0,"",{"$f":"SUM(K68:K74)","v":0}]
["Ambulance",null,null,null,null,null,null,null,0,""]
["Health Services",null,null,null,null,null,null,null,0,""]
["Laboratory Services",null,null,null,null,null,null,null,{"$f":"G70-H70","v":0},{"$f":"IF(I70=0,\"\",I70/H70)","v":""}]
["Food Control",null,null,null,null,null,null,null,{"$f":"G71-H71","v":0},{"$f":"IF(I71=0,\"\",I71/H71)","v":""}]
["Health Surveillance and Prevention of Communicable Diseases including immunizations",null,null,null,null,null,null,null,0,""]
["Vector Control",null,null,null,null,null,null,null,0,""]
["Chemical Safety",null,null,null,null,null,null,null,0,""]
["Economic and environmental services",null,{"$f":"C76+C87+C92","v":200051132.51000002},55600947.447282426,197768889.92609963,20274964.93,155987481.76000002,181288149.09892467,-25300667.338924646,-0.13956051437823808,{"$f":"K76+K87+K92","v":197768889.92609963}]
["Planning and development",null,{"$f":"SUM(C77:C86)","v":152414516.51000002},47684582.161182426,137252524.63999963,11072590.989999998,111704088.05000001,125814814.253333,-14110726.20333299,-0.11215472746254265,{"$f":"SUM(K77:K86)","v":137252524.63999963}]
["Billboards",null,0,0,0,null,null,null,{"$f":"G77-H77","v":0},{"$f":"IF(I77=0,\"\",I77/H77)","v":""}]
["Corporate Wide Strategic Planning (IDPs, LEDs)",null,-2.9999999999999361E-2,0,0,null,null,null,0,""]
["Central City Improvement District",null,0,0,0,null,null,null,0,""]
["Development Facilitation",null,0,0,0,null,null,null,{"$f":"G80-H80","v":0},{"$f":"IF(I80=0,\"\",I80/H80)","v":""}]
["Economic Development/Planning",null,35053266.509999998,0,11014562.57,8782231.9899999984,14338779.279999999,{"$f":"E81/12*11","v":10096682.355833335},{"$f":"G81-H81","v":4242096.9241666645},{"$f":"IF(I81=0,\"\",I81/H81)","v":0.42014760637842613},{"$f":"E81","v":11014562.57}]
["Regional Planning and Development",null,0,0,0,0,0,null,{"$f":"G82-H82","v":0},{"$f":"IF(I82=0,\"\",I82/H82)","v":""}]
["Town Planning, Building Regulations and Enforcement, and City Engineer",null,117361250.03000002,47684582.161182426,126237962.06999964,2290359,97365308.770000011,{"$f":"E83/12*11","v":115718131.89749967},{"$f":"G83-H83","v":-18352823.127499655},{"$f":"IF(I83=0,\"\",I83/H83)","v":-0.15859937268738614},{"$f":"E83","v":126237962.06999964}]
["Project Management Unit",null,0,0,0,null,null,null,0,""]
["Provincial Planning",null,0,0,0,null,null,null,0,""]
["Support to Local Municipalities",null,0,0,0,null,null,null,0,""]
["Road transport",null,{"$f":"SUM(C88:C91)","v":47241673.420000002},0,52600000,9157605.2300000004,43615897.030000001,48216666.666666664,-4600769.636666663,-9.5418658209471069E-2,{"$f":"SUM(K88:K91)","v":52600000}]
["Public Transport",null,-26.27,null,null,null,null,null,0,""]
["Road and Traffic Regulation",null,0,null,null,null,null,null,0,""]
["Roads",null,47241699.690000005,null,52600000,9157605.2300000004,43615897.030000001,{"$f":"E90/12*11","v":48216666.666666664},-4600769.636666663,-9.5418658209471069E-2,{"$f":"E90","v":52600000}]
["Taxi Ranks",null,0,null,null,null,null,null,0,""]
["Environmental protection",null,{"$f":"SUM(C93:C98)","v":394942.58},{"$f":"SUM(D93:D98)","v":7916365.2861000011},7916365.2861000011,44768.71,667496.67999999993,7256668.1789250011,-6589171.4989250014,-0.9080160945020801,7916365.2861000011]
["Biodiversity and Landscape",null,0,0,0,null,null,null,0,""]
["Coastal Protection",null,0,0,0,null,null,null,0,""]
["Indigenous Forests",null,0,0,0,null,null,null,{"$f":"G95-H95","v":0},{"$f":"IF(I95=0,\"\",I95/H95)","v":""}]
["Nature Conservation",null,0,0,0,null,null,null,{"$f":"G96-H96","v":0},{"$f":"IF(I96=0,\"\",I96/H96)","v":""}]
["Pollution Control",null,394942.58,7916365.2861000011,7916365.2861000011,44768.71,667496.67999999993,{"$f":"E97/12*11","v":7256668.1789250011},-6589171.4989250014,-0.9080160945020801,{"$f":"E97","v":7916365.2861000011}]
["Soil Conservation",null,0,0,0,null,null,null,0,""]
["Trading services",null,{"$f":"C100+C104+C108+C113","v":4410211201.3800001},{"$f":"D100+D104+D108+D113","v":5698134020.4703426},5275471311.9636583,-41428614.810000122,3818810814.8100023,4835848702.6333532,-1017037887.8233509,-0.21031218103856819,{"$f":"K100+K104+K108+K113","v":5275471311.9636583}]
["Energy sources",null,{"$f":"SUM(C101:C103)","v":2724539631},{"$f":"SUM(D101:D103)","v":4028755845.6152434},3712970414.2736578,-91230978.990000114,2169752049.4000025,3403556213.0841866,-1233804163.6841841,-0.36250441786185539,3712970414.2736578]
["Electricity ",null,2724539631,4028755845.6152434,3712970414.2736578,-91230978.990000114,2169752049.4000025,{"$f":"E101/12*11","v":3403556213.0841866},-1233804163.6841841,-0.36250441786185539,{"$f":"E101","v":3712970414.2736578}]
["Street Lighting and Signal Systems",null,0,0,null,null,null,null,{"$f":"G102-H102","v":0},{"$f":"IF(I102=0,\"\",I102/H102)","v":""}]
["Nonelectric Energy",null,0,0,null,null,null,null,0,""]
["Water management",null,{"$f":"SUM(C105:C107)","v":1249069243.4500003},{"$f":"SUM(D105:D107)","v":1300958055.8464499},1127612549.4100001,34874146.089999996,1198955761.6599998,1033644836.9591666,165310924.7008332,0.15993010247809489,1127612549.4100001]
["Water Treatment",null,0,0,null,null,null,null,0,""]
["Water Distribution",null,1249069243.4500003,1300958055.8464499,1127612549.4100001,34874146.089999996,1198955761.6599998,{"$f":"E106/12*11","v":1033644836.9591666},{"$f":"G106-H106","v":165310924.7008332},{"$f":"IF(I106=0,\"\",I106/H106)","v":0.15993010247809489},{"$f":"E106","v":1127612549.4100001}]
["Water Storage",null,0,0,null,null,null,null,0,""]
["Waste water management",null,{"$f":"SUM(C109:C112)","v":286349072.06000006},{"$f":"SUM(D109:D112)","v":209646015.87575004},284013369.56,7522820.790000001,299501670.38,260345588.76333332,39156081.616666675,0.15040040356612855,284013369.56]
["Public Toilets",null,0,null,null,null,null,null,0,""]
["Sewerage",null,286349072.06000006,209646015.87575004,284013369.56,7522820.790000001,299501670.38,{"$f":"E110/12*11","v":260345588.76333332},39156081.616666675,0.15040040356612855,{"$f":"E110","v":284013369.56}]
["Storm Water Management",null,0,0,null,null,null,null,{"$f":"G111-H111","v":0},{"$f":"IF(I111=0,\"\",I111/H111)","v":""}]
["Waste Water Treatment",null,0,0,null,null,null,null,0,""]
["Waste management",null,{"$f":"SUM(C114:C117)","v":150253254.87},158774103.1329,150874978.72,7405397.3000000007,150601333.37,138302063.82666665,12299269.543333352,8.8930484499117599E-2,{"$f":"SUM(K114:K117)","v":150874978.72}]
["Recycling",null,0,0,null,null,null,null,{"$f":"G114-H114","v":0},{"$f":"IF(I114=0,\"\",I114/H114)","v":""}]
["Solid Waste Disposal (Landfill Sites)",null,23607418.98,0,null,66489.009999999995,28014227.07,null,{"$f":"G115-H115","v":28014227.07},{"$f":"IF(I115=0,\"\",I115/H115)","v":{"$error":"#DIV/0!"}}]
["Solid Waste Removal",null,126645835.89,158774103.1329,150874978.72,7338908.290000001,122587106.30000001,{"$f":"E116/12*11","v":138302063.82666665},-15714957.526666641,-0.11362778755320764,{"$f":"E116","v":150874978.72}]
["Street Cleaning",null,0,0,null,null,null,null,{"$f":"G117-H117","v":0},{"$f":"IF(I117=0,\"\",I117/H117)","v":""}]
["Other",null,{"$f":"SUM(C119:C124)","v":39273819.169999994},{"$f":"SUM(D119:D124)","v":101044618.4754146},114395836.91995399,3003042.54,35468287.140000001,104862850.50995781,-69394563.369957805,-0.66176499143867995,114395836.91995399]
["Abattoirs",null,0,0,0,0,0,null,0,"",{"$f":"E119","v":0}]
["Air Transport",null,14916638.060000001,41534302.447833002,44808461.43999999,1208017.77,13113220.469999999,{"$f":"E120/12*11","v":41074422.986666657},-27961202.516666658,-0.68074486465076489,44808461.43999999]
["Forestry ",null,0,0,10143141.02,0,0,9297879.2683333326,{"$f":"G121-H121","v":-9297879.2683333326},{"$f":"IF(I121=0,\"\",I121/H121)","v":-1},10143141.02]
["Licensing and Regulation",null,394531.83999999997,2292326.484033857,2292326.5149977109,27319.73,740687.34000000008,2101299.3054145682,-1360611.9654145681,-0.64750983446698052,2292326.5149977109]
["Markets",null,23962669.469999995,57217989.543547742,57151907.94495628,1767705.04,21614379.330000002,52389248.949543253,-30774869.619543251,-0.58742719616352801,57151907.94495628]
["Tourism",null,-20.2,0,0,0,0,null,{"$f":"G124-H124","v":0},{"$f":"IF(I124=0,\"\",I124/H124)","v":""},0]
[{"$f":"\"Total \"&A5","v":"Total Revenue - Functional"},2,{"$f":"C6+C26+C75+C99+C118","v":6747922444.9400005},8569426180.2104588,8445299465.4197168,144266424.31999993,6107195671.5300026,7741524509.9680729,{"$f":"G125-H125","v":-1634328838.4380703},{"$f":"IF(I125=0,\"\",I125/H125)","v":-0.21111201499571439},{"$f":"K6+K26+K75+K99+K118","v":8445299465.4197168}]
[]
["Expenditure - Functional"]
[{"$f":"A6","v":"Municipal governance and administration"},null,{"$f":"C129+C132+C146","v":1085322316.7400002},1480552759.1052101,1740730564.9199998,124118561.78,984952092.83999991,1595669684.51,{"$f":"G128-H128","v":-610717591.67000008},{"$f":"IF(I128=0,\"\",I128/H128)","v":-0.38273434508316795},{"$f":"K129+K132+K146","v":1740730564.9199998}]
["Executive and council",null,{"$f":"SUM(C130:C131)","v":115687006.42999995},258320031.05366999,150269914,16417950.310000006,137328642.64000002,137747421.16666669,-418778.52666667104,-3.0401914106251934E-3,150269914]
["Mayor and Council",null,82943964.139999956,94350834.421950057,98594144.810000017,11559016.110000003,98560116.030000001,{"$f":"E130/12*11","v":90377966.07583335},8182149.9541666508,9.0532574580194272E-2,{"$f":"E130","v":98594144.810000017}]
["Municipal Manager, Town Secretary and Chief Executive",null,32743042.289999995,163969196.63171995,51675769.189999998,4858934.200000003,38768526.610000022,47369455.090833329,-8600928.4808333069,-0.18157119317375703,51675769.189999998]
["Finance and administration",null,{"$f":"SUM(C133:C145)","v":950234661.94000018},1193777692.58764,1560312497.4399998,105066323.28,830411732.81999993,1430286455.9866667,-599874723.16666675,-0.41940879790604607,{"$f":"SUM(K133:K145)","v":1560312497.4399998}]
["Administrative and Corporate Support",null,59317183.600000046,59777153.102950022,72744516.360000029,5603485.549999998,60418268.329999983,{"$f":"E133/12*11","v":66682473.330000021},-6264205.0000000373,-9.3940801640628582E-2,{"$f":"E133","v":72744516.360000029}]
["Asset Management",null,67830877.980000004,62176445.608900003,84807066.370000005,5536340.4399999985,60789979.360000014,77739810.839166671,-16949831.479166657,-0.21803283666632023,84807066.370000005]
["Finance",null,327425602.35000014,626500972.80509007,932401233.01999998,29888899.440000009,254104362.23999998,854701130.26833332,-600596768.02833331,-0.70269799203351468,932401233.01999998]
["Fleet Management",null,0,0,0,0,0,0,0,"",0]
["Human Resources",null,65352584.769999951,91046088.266750023,112544134.81999996,25424326.349999998,101086734.52999994,103165456.91833329,-2078722.3883333504,-2.0149403205560228E-2,112544134.81999996]
["Information Technology",null,51866475.219999991,57159369.863049999,50178991.030000001,10723216.9,41231693.909999996,45997408.444166668,-4765714.5341666713,-0.10360832697675716,50178991.030000001]
["Legal Services",null,14853751.829999998,18240282.653700002,22052233.350000001,1870722.6800000002,15189716.029999999,20214547.237500001,-5024831.2075000014,-0.24857500632902815,22052233.350000001]
["Marketing, Customer Relations, Publicity and Media Co-ordination",null,18142129.609999992,19543388.61685,24850655.309999999,33932.6,15041187.710000001,22779767.3675,-7738579.6574999988,-0.3397128483647584,24850655.309999999]
["Property Services",null,61966598.050000004,63488452.646650001,65539704.200000003,7082353.0999999987,67145148.689999998,60078062.18333333,7067086.5066666678,0.1176317319473596,65539704.200000003]
["Risk Management",null,0,0,0,0,0,0,0,"",0]
["Security Services",null,187688924.80999997,120077387.86580002,114721899.00000001,16266965.280000001,144034595.23000002,105161740.75000001,38872854.480000004,0.36964825993525596,114721899.00000001]
["Supply Chain Management ",null,95790533.719999984,75768151.157900006,80472063.980000034,2636080.9400000009,71370046.789999962,73766058.648333371,-2396011.8583334088,-3.248122378011236E-2,80472063.980000034]
["Valuation Service",null,0,null,0,0,0,0,0,"",0]
["Internal audit",null,{"$f":"SUM(C147:C147)","v":19400648.370000005},28455035.463900004,30148153.479999993,2634288.19,17211717.379999999,27635807.356666658,-10424089.976666659,-0.3771950586474192,{"$f":"SUM(K147:K147)","v":30148153.479999993}]
["Governance Function",null,19400648.370000005,28455035.463900004,30148153.479999993,2634288.19,17211717.379999999,{"$f":"E147/12*11","v":27635807.356666658},-10424089.976666659,-0.3771950586474192,{"$f":"E147","v":30148153.479999993}]
["Community and public safety",null,{"$f":"C149+C171+C177+C186+C189","v":624011514.17999995},537195647.38537049,640809790.87000012,47164931.119999997,536957643.00999999,587408974.96416664,-50451331.954166651,-8.5887914731374859E-2,{"$f":"K149+K171+K177+K186+K189","v":640809790.87000012}]
["Community and social services",null,{"$f":"SUM(C150:C170)","v":147223223.92999995},135893001.57432997,149462212.81999999,12479943.399999999,139048644.15000001,137007028.41833332,2041615.7316666842,1.4901540127071972E-2,{"$f":"SUM(K150:K170)","v":149462212.81999999}]
["Aged Care",null,2902.7200000000003,658027.55774999992,19582.849999999977,44.269999999999996,480.26000000000005,{"$f":"E150/12*11","v":17950.94583333331},-17470.685833333311,-0.97324597798583967,{"$f":"E150","v":19582.849999999977}]
["Agricultural",null,0,0,0,null,null,0,0,"",0]
["Animal Care and Diseases",null,0,1257600,1257600,null,null,1152800,-1152800,-1,1257600]
["Cemeteries, Funeral Parlours and Crematoriums",null,29156919.610000007,32803662.198449999,31034601.200000003,3139504.8499999996,31624940.020000003,28448384.433333337,3176555.586666666,0.11166031568895192,31034601.200000003]
["Child Care Facilities",null,0,0,0,0,0,0,0,"",0]
["Community Halls and Facilities",null,33451340.830000002,15799744.623949999,18620969.460000001,2656404.17,30254044.319999985,17069222.005000003,13184822.314999983,0.77243252862595713,18620969.460000001]
["Consumer Protection",null,0,0,0,null,null,0,0,"",0]
["Cultural Matters",null,0,0,0,null,null,0,{"$f":"G157-H157","v":0},{"$f":"IF(I157=0,\"\",I157/H157)","v":""},0]
["Disaster Management",null,0,0,0,null,null,0,{"$f":"G158-H158","v":0},{"$f":"IF(I158=0,\"\",I158/H158)","v":""},0]
["Education",null,0,0,0,null,null,0,{"$f":"G159-H159","v":0},{"$f":"IF(I159=0,\"\",I159/H159)","v":""},0]
["Indigenous and Customary Law",null,0,0,0,null,null,0,0,"",0]
["Industrial Promotion",null,0,0,0,null,null,0,0,"",0]
["Language Policy",null,0,0,0,null,null,0,0,"",0]
["Libraries and Archives",null,71857741.559999973,73518450.614529997,81280107.739999995,5473298.9500000002,65803749.189999998,74506765.428333327,-8703016.2383333296,-0.11680840240883358,81280107.739999995]
["Literacy Programmes",null,0,0,0,null,null,0,0,"",0]
["Media Services",null,0,0,0,null,null,0,0,"",0]
["Museums and Art Galleries",null,8325164.8900000006,6040266.1131999996,8216335.3099999987,767602.86,6557935.2300000004,7531640.7008333318,-973705.47083333135,-0.12928198642370134,8216335.3099999987]
["Population Development",null,4422169.1599999992,5815250.4664500011,9033016.2599999998,442550.98,4801584.6100000003,8280264.9049999993,-3478680.294999999,-0.42011702945631779,9033016.2599999998]
["Provincial Cultural Matters",null,0,null,0,0,0,0,0,"",0]
["Theatres",null,6985.16,null,0,537.32000000000005,5910.5199999999995,0,5910.5199999999995,{"$error":"#DIV/0!"},0]
["Zoo's",null,0,null,0,null,null,0,0,"",0]
["Sport and recreation",null,{"$f":"SUM(C172:C176)","v":140506827.45000005},130424689.03570996,134183742.56000005,12736345.380000005,134054301.42000006,123001764.01333338,11052537.406666681,8.9856739009601422E-2,134183742.56000005]
["Beaches and Jetties ",null,0,null,0,null,null,null,0,""]
["Casinos, Racing, Gambling, Wagering",null,0,null,0,null,null,null,0,""]
["Community Parks (including Nurseries)",null,54831338.680000007,72878671.55377996,52323003.180000007,5547548.1500000041,46130654.749999993,{"$f":"E174/12*11","v":47962752.915000007},-1832098.165000014,-3.8198352964578026E-2,{"$f":"E174","v":52323003.180000007}]
["Recreational Facilities",null,85228537.940000027,56465275.913929991,81146797.810000047,7188797.2300000004,87900491.030000061,74384564.659166709,13515926.370833352,0.18170337398308253,81146797.810000047]
["Sports Grounds and Stadiums",null,446950.83,1080741.568,713941.57000000007,0,23155.64,654446.43916666671,-631290.79916666669,-0.96461797541524552,713941.57000000007]
["Public safety",null,{"$f":"SUM(C178:C185)","v":232287900.66999999},222097496.01233053,259339347.92000002,14946010.579999994,185421982.88999996,237727735.5933333,-52305752.703333348,-0.22002377035555368,259339347.92000002]
["Civil Defence",null,15312006.23,19219679.351999991,34437570.120000012,248224.06000000003,16753614.880000001,{"$f":"E178/12*11","v":31567772.610000014},-14814157.730000013,-0.469281058027743,{"$f":"E178","v":34437570.120000012}]
["Cleansing",null,0,0,0,null,null,null,0,"",0]
["Control of Public Nuisances",null,0,0,0,null,null,null,{"$f":"G180-H180","v":0},{"$f":"IF(I180=0,\"\",I180/H180)","v":""},0]
["Fencing and Fences ",null,0,0,0,null,null,null,0,"",0]
["Fire Fighting and Protection",null,116742940.88,115276517.82308057,144144962.28,8161227.8499999968,92726514.069999963,{"$f":"E182/12*11","v":132132882.08999999},-39406368.020000026,-0.29823286525422998,144144962.28]
["Licensing and Control of Animals",null,0,0,0,null,null,null,{"$f":"G183-H183","v":0},{"$f":"IF(I183=0,\"\",I183/H183)","v":""},0]
["Police Forces, Traffic and Street Parking Control",null,100232953.55999999,87601298.837249979,80756815.519999996,6536558.6699999981,75941853.939999998,{"$f":"E184/12*11","v":74027080.893333331},{"$f":"G184-H184","v":1914773.0466666669},{"$f":"IF(I184=0,\"\",I184/H184)","v":2.5865845627841121E-2},80756815.519999996]
["Pounds",null,0,0,0,null,null,null,0,""]
["Housing",null,{"$f":"SUM(C187:C188)","v":94434776.87999998},35263319.4102,87641516.190000042,6394712.4600000018,69165804.449999973,80338056.507500038,{"$f":"G186-H186","v":-11172252.057500064},{"$f":"IF(I186=0,\"\",I186/H186)","v":-0.13906550075003454},{"$f":"SUM(K187:K188)","v":87641516.190000042}]
["Housing",null,94434776.87999998,35263319.4102,87641516.190000042,6394712.4600000018,69165804.449999973,{"$f":"E187/12*11","v":80338056.507500038},{"$f":"G187-H187","v":-11172252.057500064},{"$f":"IF(I187=0,\"\",I187/H187)","v":-0.13906550075003454},{"$f":"E187","v":87641516.190000042}]
["Informal Settlements",null,0,null,0,null,null,null,{"$f":"G188-H188","v":0},{"$f":"IF(I188=0,\"\",I188/H188)","v":""}]
["Health",null,{"$f":"SUM(C190:C196)","v":9558785.25},13517141.352799997,10182971.379999999,607919.30000000005,9266910.0999999978,9334390.4316666648,-67480.331666667014,-7.2292167507523397E-3,10182971.379999999]
["Ambulance",null,0,null,null,null,null,null,0,""]
["Health Services",null,9558785.25,13517141.352799997,10182971.379999999,607919.30000000005,9266910.0999999978,{"$f":"E191/12*11","v":9334390.4316666648},-67480.331666667014,-7.2292167507523397E-3,{"$f":"E191","v":10182971.379999999}]
[{"$f":"A70","v":"Laboratory Services"},null,0,null,null,null,null,null,0,""]
["Food Control",null,0,null,null,null,null,null,{"$f":"G193-H193","v":0},{"$f":"IF(I193=0,\"\",I193/H193)","v":""}]
["Health Surveillance and Prevention of Communicable Diseases including immunizations",null,0,null,null,null,null,null,{"$f":"G194-H194","v":0},{"$f":"IF(I194=0,\"\",I194/H194)","v":""}]
["Vector Control",null,0,null,null,null,null,null,0,""]
["Chemical Safety",null,0,null,null,null,null,null,0,""]
["Economic and environmental services",null,{"$f":"C198+C209+C214","v":378225313.45000005},513621030.73583996,490950688.08999979,43188503.289999992,381483135.1500001,450038130.74916649,-68554995.599166393,-0.15233152685316845,{"$f":"K198+K209+K214","v":490950688.08999979}]
["Planning and development",null,{"$f":"SUM(C199:C208)","v":93765700.129999995},84862819.172940001,104058486.33999994,11778687.599999998,82004672.36999999,95386945.811666623,-13382273.441666633,-0.14029460035431671,104058486.33999994]
["Billboards",null,0,0,0,null,null,null,0,""]
["Corporate Wide Strategic Planning (IDPs, LEDs)",null,10215065.729999999,9449713.0767499972,9405329.4999999981,614600.74,8759932.089999998,{"$f":"E200/12*11","v":8621552.0416666642},138380.04833333381,1.6050479967477299E-2,{"$f":"E200","v":9405329.4999999981}]
["Central City Improvement District",null,0,0,0,null,null,null,0,"",0]
["Development Facilitation",null,0,0,0,null,null,null,{"$f":"G202-H202","v":0},{"$f":"IF(I202=0,\"\",I202/H202)","v":""},0]
["Economic Development/Planning",null,13288993.039999997,13694455.520049999,15617020.029999999,4645609.42,15425898.320000002,{"$f":"E203/12*11","v":14315601.694166666},{"$f":"G203-H203","v":1110296.6258333363},{"$f":"IF(I203=0,\"\",I203/H203)","v":7.7558502223889117E-2},15617020.029999999]
["Regional Planning and Development",null,0,0,0,null,null,null,{"$f":"G204-H204","v":0},{"$f":"IF(I204=0,\"\",I204/H204)","v":""},0]
["Town Planning, Building Regulations and Enforcement, and City Engineer",null,70261641.359999999,61718650.576140009,79036136.809999943,6518477.4399999967,57818841.959999993,{"$f":"E205/12*11","v":72449792.075833291},{"$f":"G205-H205","v":-14630950.115833297},{"$f":"IF(I205=0,\"\",I205/H205)","v":-0.20194606080468888},79036136.809999943]
["Project Management Unit",null,0,null,0,null,null,null,{"$f":"G206-H206","v":0},{"$f":"IF(I206=0,\"\",I206/H206)","v":""}]
["Provincial Planning",null,0,null,0,null,null,null,0,""]
["Support to Local Municipalities",null,0,null,0,null,null,null,0,""]
["Road transport",null,{"$f":"SUM(C210:C213)","v":259798778.12000006},402475671.16714996,361406895.76999986,29285544.529999997,275503426.26000011,331289654.4558332,-55786228.195833087,-0.16839109656915163,{"$f":"SUM(K210:K213)","v":361406895.76999986}]
["Public Transport",null,9338758.6299999971,6742509.3140500011,8588915.3300000019,714872.74999999988,10694331.92,{"$f":"E210/12*11","v":7873172.3858333351},2821159.5341666648,0.35832564002319373,{"$f":"E210","v":8588915.3300000019}]
["Road and Traffic Regulation",null,0,0,0,0,0,0,{"$f":"G211-H211","v":0},{"$f":"IF(I211=0,\"\",I211/H211)","v":""},0]
["Roads",null,249513043.52000007,393924556.45119995,351009375.02999985,28513794.269999996,264184754.66000009,321758593.77749985,-57573839.117499769,-0.17893489165766557,351009375.02999985]
["Taxi Ranks",null,946975.96999999974,1808605.4018999997,1808605.41,56877.509999999995,624339.67999999993,1657888.2925,-1033548.6125,-0.62341269745108596,1808605.41]
["Environmental protection",null,{"$f":"SUM(C215:C220)","v":24660835.199999999},26282540.395750005,25485305.979999997,2124271.1599999997,23975036.52,23361530.481666662,613506.03833333775,2.6261380384080425E-2,25485305.979999997]
["Biodiversity and Landscape",null,0,null,0,null,null,null,0,""]
["Coastal Protection",null,0,null,0,null,null,null,0,""]
["Indigenous Forests",null,0,null,0,null,null,null,0,""]
["Nature Conservation",null,5316460.6099999994,6467961.4522500001,5190921.879999999,603562.24999999988,5443983.4699999988,{"$f":"E218/12*11","v":4758345.0566666657},{"$f":"G218-H218","v":685638.4133333331},{"$f":"IF(I218=0,\"\",I218/H218)","v":0.14409178089611668},{"$f":"E218","v":5190921.879999999}]
["Pollution Control",null,19344374.59,19814578.943500005,20294384.099999998,1520708.91,18531053.050000001,18603185.424999997,{"$f":"G219-H219","v":-72132.374999996275},{"$f":"IF(I219=0,\"\",I219/H219)","v":-3.877420632654705E-3},20294384.099999998]
["Soil Conservation",null,0,null,0,null,null,null,0,""]
["Trading services",null,{"$f":"C222+C226+C230+C235","v":4061495012.9100037},{"$f":"D222+D226+D230+D235","v":5109852270.9189796},4628143773.8500004,367399100.21999991,4040066218.1900029,4242465126.0291672,-202398907.83916414,-4.7707854237237786E-2,{"$f":"K222+K226+K230+K235","v":4628143773.8500004}]
["Energy sources",null,{"$f":"SUM(C223:C225)","v":2621122229.710001},3289791559.6896291,3113161655.1600013,236179941.34999996,2780945943.7200031,2853731517.230001,-72785573.509997845,-2.5505403388699926E-2,3113161655.1600013]
["Electricity ",null,2618373146.7800012,3289791559.6896291,3113161655.1600013,236179931.06999996,2781064015.9400029,{"$f":"E223/12*11","v":2853731517.230001},-72667501.289998055,-2.546402871161944E-2,{"$f":"E223","v":3113161655.1600013}]
["Street Lighting and Signal Systems",null,2749082.9299999997,0,null,10.28,-118072.22,null,{"$f":"G224-H224","v":-118072.22},{"$f":"IF(I224=0,\"\",I224/H224)","v":{"$error":"#DIV/0!"}}]
["Nonelectric Energy",null,0,0,null,0,0,null,0,""]
["Water management",null,{"$f":"SUM(C227:C229)","v":952915577.47000265},1293156973.5049391,997172145.62999964,92509825.529999971,817992947.91999996,914074466.82749963,-96081518.907499671,-0.10511344796772644,997172145.62999964]
["Water Treatment",null,0,0,null,null,null,null,0,""]
["Water Distribution",null,952915577.47000265,1293156973.5049391,997172145.62999964,92509825.529999971,817992947.91999996,{"$f":"E228/12*11","v":914074466.82749963},{"$f":"G228-H228","v":-96081518.907499671},{"$f":"IF(I228=0,\"\",I228/H228)","v":-0.10511344796772644},{"$f":"E228","v":997172145.62999964}]
["Water Storage",null,0,0,null,null,null,null,0,""]
["Waste water management",null,{"$f":"SUM(C231:C234)","v":348153877.7700001},399300023.23709154,368517895.44,28345919.709999997,316674692.38999999,337808070.81999993,-21133378.429999948,-6.2560312365244841E-2,368517895.44]
["Public Toilets",null,4427054,3781334.1134100002,3659948.13,857217.42999999993,6967989.0500000007,{"$f":"E231/12*11","v":3354952.4524999997},3613036.5975000011,1.0769263197180889,{"$f":"E231","v":3659948.13}]
["Sewerage",null,317132992.94000012,363938329.14618152,338771723.89999998,27485831.309999999,288612789.80999994,310540746.9083333,-21927957.098333359,-7.0612173496208352E-2,338771723.89999998]
["Storm Water Management",null,26593830.829999998,31580359.97750001,26086223.41,2870.9700000000003,21093913.530000001,23912371.459166665,{"$f":"G233-H233","v":-2818457.9291666634},{"$f":"IF(I233=0,\"\",I233/H233)","v":-0.11786609847457118},26086223.41]
["Waste Water Treatment",null,0,0,0,0,0,null,0,""]
["Waste management",null,{"$f":"SUM(C236:C239)","v":139303327.95999998},127603714.48732021,149292077.62000003,10363413.629999997,124452634.16000001,136851071.1516667,-12398436.99166669,-9.0598026652827485E-2,{"$f":"SUM(K236:K239)","v":149292077.62000003}]
["Recycling",null,0,0,0,0,0,{"$f":"E236/12*11","v":0},{"$f":"G236-H236","v":0},{"$f":"IF(I236=0,\"\",I236/H236)","v":""}]
["Solid Waste Disposal (Landfill Sites)",null,19589240.729999997,16324162.11723,11514879.73,2062509.1899999997,12477905.350000003,10555306.419166667,{"$f":"G237-H237","v":1922598.930833336},{"$f":"IF(I237=0,\"\",I237/H237)","v":0.18214525040620502},{"$f":"E237","v":11514879.73}]
["Solid Waste Removal",null,119714087.22999997,111279552.37009022,137777197.89000005,8300904.4399999967,111974728.81,126295764.73250005,{"$f":"G238-H238","v":-14321035.922500044},{"$f":"IF(I238=0,\"\",I238/H238)","v":-0.11339284379672292},137777197.89000005]
["Street Cleaning",null,0,null,0,0,0,null,0,""]
["Other",null,{"$f":"SUM(C241:C246)","v":73187988.519995749},63978086.854600012,63376572.453357965,6051989.2300000004,64767393.929999992,58095191.415578142,6672202.5144218504,0.11484947982515312,63376572.453357965]
["Abattoirs",null,0,0,0,0,0,null,0,""]
["Air Transport",null,25801978.899999991,20656518.23855,30507316.960000008,2298242.2399999998,23005669.150000002,{"$f":"E242/12*11","v":27965040.546666674},-4959371.3966666721,-0.17734182750032917,{"$f":"E242","v":30507316.960000008}]
["Forestry ",null,6285176.7699999996,1838278.6540999997,1488278.6400000001,69427.58,907249.99999999988,1364255.4200000002,{"$f":"G243-H243","v":-457005.42000000027},{"$f":"IF(I243=0,\"\",I243/H243)","v":-0.33498523319042428},1488278.6400000001]
["Licensing and Regulation",null,5389931.4499999993,6622068.8997499999,5640932.21,393671.58,4993844.0299999993,5170854.5258333329,-177010.49583333358,-3.4232348821456475E-2,5640932.21]
["Markets",null,31746556.469995748,28847018.797550008,19963038.999999996,3084968.9200000004,31101228.129999995,18299452.416666664,{"$f":"G245-H245","v":12801775.713333331},{"$f":"IF(I245=0,\"\",I245/H245)","v":0.69957151841733844},19963038.999999996]
["Tourism",null,3964344.9299999997,6014202.2646499993,5777005.6433579652,205678.91,4759402.620000001,5295588.5064114677,{"$f":"G246-H246","v":-536185.88641146664},{"$f":"IF(I246=0,\"\",I246/H246)","v":-0.10125142574093444},5777005.6433579652]
[{"$f":"\"Total \"&A127","v":"Total Expenditure - Functional"},3,{"$f":"C128+C148+C197+C221+C240","v":6222242145.7999992},7705199795,7564011390.1833572,587923085.63999987,6008226483.1200027,6933677107.6680784,-925450624.54807544,{"$f":"IF(I247=0,\"\",I247/H247)","v":-0.13347183755133377},{"$f":"K128+K148+K197+K221+K240","v":7564011390.1833572}]
[{"$f":"result","v":"Surplus/ (Deficit) for the year"},null,{"$f":"C125-C247","v":525680299.1400013},864226385.21045876,881288075.2363596,-443656661.31999993,98969188.409999847,807847402.29999447,{"$f":"G248-H248","v":-708878213.88999462},{"$f":"IF(I248=0,\"\",I248/H248)","v":-0.87749024366702411},{"$f":"K125-K247","v":881288075.2363596}]
[{"$f":"head27a","v":"References"}]
["1. Government Finance Statistics Functions and Sub-functions are standardised to assist national and international accounts and comparison"]
["2. Total Revenue by Functional Classification must reconcile to total operating revenue shown in Financial Performance (revenue and expenditure)"]
["3. Total Expenditure by Functional Classification must reconcile to total operating expenditure shown in Financial Performance (revenue and expenditure)"]
["4. All amounts must be classified under a Functional classification. The function 'Other' is only for Abbatoirs, Air Transport, Licensing and Regulation, Markets and Tourism - and if used must be supported by footnotes. Nothing else may be placed under 'Other'. Assign associate share to relevant classification"]
[]
[]
["check oprev balance",null,{"$f":"C125-'C4-FinPerf RE'!C65","v":0},{"$f":"D125-'C4-FinPerf RE'!D65","v":0},{"$f":"E125-'C4-FinPerf RE'!E65","v":0},{"$f":"F125-'C4-FinPerf RE'!F65","v":0},{"$f":"G125-'C4-FinPerf RE'!G65","v":0},0,{"$f":"I125-'C4-FinPerf RE'!I65","v":4.76837158203125E-6},null,{"$f":"K125-'C4-FinPerf RE'!K65","v":0}]
["check opexp balance",null,{"$f":"C247-'C4-FinPerf RE'!C48","v":0},{"$f":"D247-'C4-FinPerf RE'!D48","v":0},{"$f":"E247-'C4-FinPerf RE'!E48","v":0},{"$f":"F247-'C4-FinPerf RE'!F48","v":0},{"$f":"G247-'C4-FinPerf RE'!G48","v":0},0,{"$f":"I247-'C4-FinPerf RE'!I48","v":4.0531158447265625E-6},null,{"$f":"K247-'C4-FinPerf RE'!K48","v":0}]

{"sheet":"C3-FinPerf V","index":9,"n_rows":43,"n_cols":11,"rows_kept":43,"cut":false,"hidden":false,"merged":[[0,0,0,10],[1,1,3,1],[1,3,1,10]]}
[{"$f":"muni& \" - \"&S71C& \" - \"&date","v":"KZN225 Msunduzi - Table C3 Consolidated Monthly Budget Statement - Financial Performance (revenue and expenditure by municipal vote)  - M11 May"}]
[{"$f":"Vdesc","v":"Vote Description"},{"$f":"head27","v":"Ref"},{"$f":"Head1","v":"2022/23"},{"$f":"Head2","v":"Budget Year 2023/24"}]
[null,null,{"$f":"Head5","v":"Audited Outcome"},{"$f":"Head6","v":"Original Budget"},{"$f":"Head7","v":"Adjusted Budget"},{"$f":"Head38","v":"Monthly actual"},{"$f":"Head39","v":"YearTD actual"},{"$f":"Head40","v":"YearTD budget"},{"$f":"Head41","v":"YTD variance"},{"$f":"Head41","v":"YTD variance"},{"$f":"Head8","v":"Full Year Forecast"}]
["R thousands",null,null,null,null,null,null,null,null,"%"]
["Revenue by Vote",1]
[{"$f":"'Org structure'!A2","v":"Vote 1 - City Manager"},null,{"$f":"'C3C'!C6","v":-14882.48},{"$f":"'C3C'!D6","v":0},{"$f":"'C3C'!E6","v":0},{"$f":"'C3C'!F6","v":0},{"$f":"'C3C'!G6","v":0},{"$f":"'C3C'!H6","v":0},{"$f":"G6-H6","v":0},{"$f":"IF(I6=0,\"\",I6/H6)","v":""},{"$f":"'C3C'!K6","v":0}]
[{"$f":"'Org structure'!A3","v":"Vote 2 - City Finance"},null,{"$f":"'C3C'!C17","v":1855452216.8800004},{"$f":"'C3C'!D17","v":2342934596.9894886},{"$f":"'C3C'!E17","v":2596123423.8799996},{"$f":"'C3C'!F17","v":136371334.77999997},{"$f":"'C3C'!G17","v":1927895410.9299996},{"$f":"'C3C'!H17","v":2379779805.2233329},{"$f":"G7-H7","v":-451884394.29333329},{"$f":"IF(I7=0,\"\",I7/H7)","v":-0.1898849604915131},{"$f":"'C3C'!K17","v":2596123423.8799996}]
[{"$f":"'Org structure'!A4","v":"Vote 3 - Corporate Services"},null,{"$f":"'C3C'!C28","v":8603314.8800000008},{"$f":"'C3C'!D28","v":7980216.9733000007},{"$f":"'C3C'!E28","v":7910911.9800000014},{"$f":"'C3C'!F28","v":837363.83},{"$f":"'C3C'!G28","v":5725039.290000001},{"$f":"'C3C'!H28","v":7251669.3150000013},-1526630.0250000004,-0.2105211860450093,{"$f":"'C3C'!K28","v":7910911.9800000014}]
[{"$f":"'Org structure'!A5","v":"Vote 4 - Community Services and Social Equity"},null,{"$f":"'C3C'!C39","v":235448191.56},{"$f":"'C3C'!D39","v":497013172.69024205},{"$f":"'C3C'!E39","v":296214767.75000012},{"$f":"'C3C'!F39","v":18907399.27},{"$f":"'C3C'!G39","v":224660746.71000001},{"$f":"'C3C'!H39","v":271530203.77083343},-46869457.060833424,-0.17261231498353088,{"$f":"'C3C'!K39","v":296214767.75000012}]
[{"$f":"'Org structure'!A6","v":"Vote 5 - Infrastructure Services"},null,{"$f":"'C3C'!C50","v":1628015024.9400005},{"$f":"'C3C'!D50","v":1520657146.0191998},{"$f":"'C3C'!E50","v":1473469435.2500002},{"$f":"'C3C'!F50","v":52434332},{"$f":"'C3C'!G50","v":1547809642.54},{"$f":"'C3C'!H50","v":1350680315.6458335},197129326.89416647,0.14594817486468531,{"$f":"'C3C'!K50","v":1473469435.2500002}]
[{"$f":"'Org structure'!A7","v":"Vote 6 - Sustainable Development and City Enterprises"},null,{"$f":"'C3C'!C61","v":248423314.13999999},{"$f":"'C3C'!D61","v":200280366.01151729},{"$f":"'C3C'!E61","v":473092745.77999997},{"$f":"'C3C'!F61","v":24668476.059999995},{"$f":"'C3C'!G61","v":229056919.16999999},{"$f":"'C3C'!H61","v":433668350.29833329},-204611431.1283333,-0.471815457566998,{"$f":"'C3C'!K61","v":473092745.77999997}]
[{"$f":"'Org structure'!A8","v":"Vote 7 - Electricity"},null,{"$f":"'C3C'!C72","v":2771995265.0200005},{"$f":"'C3C'!D72","v":4000560679.3162532},{"$f":"'C3C'!E72","v":3598488181.3129587},{"$f":"'C3C'!F72","v":-88952481.620000005},{"$f":"'C3C'!G72","v":2172047912.8900023},{"$f":"'C3C'!H72","v":3298614166.2035456},-1126566253.3135433,-0.34152713732207596,{"$f":"'C3C'!K72","v":3598488181.3129587}]
[{"$f":"'Org structure'!A9","v":"Vote 8 - [NAME OF VOTE 8]"},null,{"$f":"'C3C'!C83","v":0},{"$f":"'C3C'!D83","v":0},{"$f":"'C3C'!E83","v":0},{"$f":"'C3C'!F83","v":0},{"$f":"'C3C'!G83","v":0},{"$f":"'C3C'!H83","v":0},0,"",{"$f":"'C3C'!K83","v":0}]
[{"$f":"'Org structure'!A10","v":"Vote 9 - [NAME OF VOTE 9]"},null,{"$f":"'C3C'!C94","v":0},{"$f":"'C3C'!D94","v":0},{"$f":"'C3C'!E94","v":0},{"$f":"'C3C'!F94","v":0},{"$f":"'C3C'!G94","v":0},{"$f":"'C3C'!H94","v":0},0,"",{"$f":"'C3C'!K94","v":0}]
[{"$f":"'Org structure'!A11","v":"Vote 10 - [NAME OF VOTE 10]"},null,{"$f":"'C3C'!C105","v":0},{"$f":"'C3C'!D105","v":0},{"$f":"'C3C'!E105","v":0},{"$f":"'C3C'!F105","v":0},{"$f":"'C3C'!G105","v":0},{"$f":"'C3C'!H105","v":0},0,"",{"$f":"'C3C'!K105","v":0}]
[{"$f":"'Org structure'!A12","v":"Vote 11 - [NAME OF VOTE 11]"},null,{"$f":"'C3C'!C116","v":0},{"$f":"'C3C'!D116","v":0},{"$f":"'C3C'!E116","v":0},{"$f":"'C3C'!F116","v":0},{"$f":"'C3C'!G116","v":0},{"$f":"'C3C'!H116","v":0},0,"",{"$f":"'C3C'!K116","v":0}]
[{"$f":"'Org structure'!A13","v":"Vote 12 - [NAME OF VOTE 12]"},null,{"$f":"'C3C'!C127","v":0},{"$f":"'C3C'!D127","v":0},{"$f":"'C3C'!E127","v":0},{"$f":"'C3C'!F127","v":0},{"$f":"'C3C'!G127","v":0},{"$f":"'C3C'!H127","v":0},0,"",{"$f":"'C3C'!K127","v":0}]
[{"$f":"'Org structure'!A14","v":"Vote 13 - [NAME OF VOTE 13]"},null,{"$f":"'C3C'!C138","v":0},{"$f":"'C3C'!D138","v":0},{"$f":"'C3C'!E138","v":0},{"$f":"'C3C'!F138","v":0},{"$f":"'C3C'!G138","v":0},{"$f":"'C3C'!H138","v":0},0,"",{"$f":"'C3C'!K138","v":0}]
[{"$f":"'Org structure'!A15","v":"Vote 14 - [NAME OF VOTE 14]"},null,{"$f":"'C3C'!C149","v":0},{"$f":"'C3C'!D149","v":0},{"$f":"'C3C'!E149","v":0},{"$f":"'C3C'!F149","v":0},{"$f":"'C3C'!G149","v":0},{"$f":"'C3C'!H149","v":0},0,"",{"$f":"'C3C'!K149","v":0}]
[{"$f":"'Org structure'!A16","v":"Vote 15 - [NAME OF VOTE 15]"},null,{"$f":"'C3C'!C160","v":0},{"$f":"'C3C'!D160","v":0},{"$f":"'C3C'!E160","v":0},{"$f":"'C3C'!F160","v":0},{"$f":"'C3C'!G160","v":0},{"$f":"'C3C'!H160","v":0},0,"",{"$f":"'C3C'!K160","v":0}]
["Total Revenue by Vote",2,{"$f":"SUM(C6:C20)","v":6747922444.9400005},{"$f":"SUM(D6:D20)","v":8569426178},8445299465.9529581,144266424.31999999,6107195671.5300016,7741524510.4568787,-1634328838.926877,-0.21111201504552551,{"$f":"SUM(K6:K20)","v":8445299465.9529581}]
[]
["Expenditure by Vote",1]
[{"$f":"'Org structure'!A2","v":"Vote 1 - City Manager"},null,{"$f":"'C3C'!C174","v":151981634.60999992},{"$f":"'C3C'!D174","v":300105971.0701499},{"$f":"'C3C'!E174","v":197403240.57999989},{"$f":"'C3C'!F174","v":19595320.720000003},{"$f":"'C3C'!G174","v":169406424.27000001},{"$f":"'C3C'!H174","v":180952970.53166661},{"$f":"G24-H24","v":-11546546.261666596},{"$f":"IF(I24=0,\"\",I24/H24)","v":-6.380965301504106E-2},{"$f":"'C3C'!K174","v":197403240.57999989}]
[{"$f":"'Org structure'!A3","v":"Vote 2 - City Finance"},null,{"$f":"'C3C'!C185","v":362344580.91999996},{"$f":"'C3C'!D185","v":799187822.74149001},{"$f":"'C3C'!E185","v":1208252870.9000001},{"$f":"'C3C'!F185","v":39675503.960000008},{"$f":"'C3C'!G185","v":397879930.71999991},{"$f":"'C3C'!H185","v":1107565131.6583335},-709685200.93833363,-0.64076159555125867,{"$f":"'C3C'!K185","v":1208252870.9000001}]
[{"$f":"'Org structure'!A4","v":"Vote 3 - Corporate Services"},null,{"$f":"'C3C'!C196","v":163339219.33999994},{"$f":"'C3C'!D196","v":195633443.38037002},{"$f":"'C3C'!E196","v":158753924.93000004},{"$f":"'C3C'!F196","v":39640454.899999991},{"$f":"'C3C'!G196","v":187524442.74999991},{"$f":"'C3C'!H196","v":145524431.18583333},42000011.564166576,0.28861141199399676,{"$f":"'C3C'!K196","v":158753924.93000004}]
[{"$f":"'Org structure'!A5","v":"Vote 4 - Community Services and Social Equity"},null,{"$f":"'C3C'!C207","v":904576995.85999978},{"$f":"'C3C'!D207","v":827458053.8400197},{"$f":"'C3C'!E207","v":1241622856.52},{"$f":"'C3C'!F207","v":74145159.920000017},{"$f":"'C3C'!G207","v":787868374.91999996},{"$f":"'C3C'!H207","v":1138154285.1433332},-350285910.22333324,-0.30776663128691739,{"$f":"'C3C'!K207","v":1241622856.52}]
[{"$f":"'Org structure'!A6","v":"Vote 5 - Infrastructure Services"},null,{"$f":"'C3C'!C218","v":1565729441.47},{"$f":"'C3C'!D218","v":2117250005.9725699},{"$f":"'C3C'!E218","v":639125706.72000003},{"$f":"'C3C'!F218","v":150272266.87999997},{"$f":"'C3C'!G218","v":1410615331.5499997},{"$f":"'C3C'!H218","v":585865231.15999997},824750100.38999975,1.4077471345364072,{"$f":"'C3C'!K218","v":639125706.72000003}]
[{"$f":"'Org structure'!A7","v":"Vote 6 - Sustainable Development and City Enterprises"},null,{"$f":"'C3C'!C229","v":295042335.31999993},{"$f":"'C3C'!D229","v":225419326.25767064},{"$f":"'C3C'!E229","v":668477444.02359974},{"$f":"'C3C'!F229","v":25596241.629999992},{"$f":"'C3C'!G229","v":248958823.32999992},{"$f":"'C3C'!H229","v":612770990.35496652},-363812167.0249666,-0.59371636835193053,{"$f":"'C3C'!K229","v":668477444.02359974}]
[{"$f":"'Org structure'!A8","v":"Vote 7 - Electricity"},null,{"$f":"'C3C'!C240","v":2779227938.2799997},{"$f":"'C3C'!D240","v":3240145171.7377305},{"$f":"'C3C'!E240","v":3450375344.8363972},{"$f":"'C3C'!F240","v":238998137.63},{"$f":"'C3C'!G240","v":2805973155.5800004},{"$f":"'C3C'!H240","v":3162844066.1000309},-356870910.5200305,-0.11283228102992536,{"$f":"'C3C'!K240","v":3450375344.8363972}]
[{"$f":"'Org structure'!A9","v":"Vote 8 - [NAME OF VOTE 8]"},null,{"$f":"'C3C'!C251","v":0},{"$f":"'C3C'!D251","v":0},{"$f":"'C3C'!E251","v":0},{"$f":"'C3C'!F251","v":0},{"$f":"'C3C'!G251","v":0},{"$f":"'C3C'!H251","v":0},0,"",{"$f":"'C3C'!K251","v":0}]
[{"$f":"'Org structure'!A10","v":"Vote 9 - [NAME OF VOTE 9]"},null,{"$f":"'C3C'!C262","v":0},{"$f":"'C3C'!D262","v":0},{"$f":"'C3C'!E262","v":0},{"$f":"'C3C'!F262","v":0},{"$f":"'C3C'!G262","v":0},{"$f":"'C3C'!H262","v":0},0,"",{"$f":"'C3C'!K262","v":0}]
[{"$f":"'Org structure'!A11","v":"Vote 10 - [NAME OF VOTE 10]"},null,{"$f":"'C3C'!C273","v":0},{"$f":"'C3C'!D273","v":0},{"$f":"'C3C'!E273","v":0},{"$f":"'C3C'!F273","v":0},{"$f":"'C3C'!G273","v":0},{"$f":"'C3C'!H273","v":0},0,{"$f":"IF(I33=0,\"\",I33/H33)","v":""},{"$f":"'C3C'!K273","v":0}]
[{"$f":"'Org structure'!A12","v":"Vote 11 - [NAME OF VOTE 11]"},null,{"$f":"'C3C'!C284","v":0},{"$f":"'C3C'!D284","v":0},{"$f":"'C3C'!E284","v":0},{"$f":"'C3C'!F284","v":0},{"$f":"'C3C'!G284","v":0},{"$f":"'C3C'!H284","v":0},0,{"$f":"IF(I34=0,\"\",I34/H34)","v":""},{"$f":"'C3C'!K284","v":0}]
[{"$f":"'Org structure'!A13","v":"Vote 12 - [NAME OF VOTE 12]"},null,{"$f":"'C3C'!C295","v":0},{"$f":"'C3C'!D295","v":0},{"$f":"'C3C'!E295","v":0},{"$f":"'C3C'!F295","v":0},{"$f":"'C3C'!G295","v":0},{"$f":"'C3C'!H295","v":0},0,{"$f":"IF(I35=0,\"\",I35/H35)","v":""},{"$f":"'C3C'!K295","v":0}]
[{"$f":"'Org structure'!A14","v":"Vote 13 - [NAME OF VOTE 13]"},null,{"$f":"'C3C'!C306","v":0},{"$f":"'C3C'!D306","v":0},{"$f":"'C3C'!E306","v":0},{"$f":"'C3C'!F306","v":0},{"$f":"'C3C'!G306","v":0},{"$f":"'C3C'!H306","v":0},0,{"$f":"IF(I36=0,\"\",I36/H36)","v":""},{"$f":"'C3C'!K306","v":0}]
[{"$f":"'Org structure'!A15","v":"Vote 14 - [NAME OF VOTE 14]"},null,{"$f":"'C3C'!C317","v":0},{"$f":"'C3C'!D317","v":0},{"$f":"'C3C'!E317","v":0},{"$f":"'C3C'!F317","v":0},{"$f":"'C3C'!G317","v":0},{"$f":"'C3C'!H317","v":0},0,{"$f":"IF(I37=0,\"\",I37/H37)","v":""},{"$f":"'C3C'!K317","v":0}]
[{"$f":"'Org structure'!A16","v":"Vote 15 - [NAME OF VOTE 15]"},null,{"$f":"'C3C'!C328","v":0},{"$f":"'C3C'!D328","v":0},{"$f":"'C3C'!E328","v":0},{"$f":"'C3C'!F328","v":0},{"$f":"'C3C'!G328","v":0},{"$f":"'C3C'!H328","v":0},0,"",{"$f":"'C3C'!K328","v":0}]
["Total Expenditure by Vote",2,{"$f":"SUM(C24:C38)","v":6222242145.7999992},{"$f":"SUM(D24:D38)","v":7705199795},7564011388.5099974,587923085.63999999,6008226483.1199999,6933677106.1341648,-925450623.01416433,{"$f":"IF(I39=0,\"\",I39/H39)","v":-0.13347183735963505},{"$f":"SUM(K24:K38)","v":7564011388.5099974}]
[{"$f":"result","v":"Surplus/ (Deficit) for the year"},2,{"$f":"C21-C39","v":525680299.1400013},864226383,881288077.44296074,-443656661.31999999,98969188.410001755,807847404.32271385,{"$f":"I21-I39","v":-708878215.91271269},{"$f":"IF(I40=0,\"\",I40/H40)","v":-0.87749024397376718},{"$f":"K21-K39","v":881288077.44296074}]
[{"$f":"head27a","v":"References"}]
["1. Insert 'Vote'; e.g. Department, if different to standard classification structure"]
["2. Must reconcile to Monthly Budget Statement - Financial Performance Statement (standard classification)"]

{"sheet":"C3C","index":10,"n_rows":348,"n_cols":23,"rows_kept":348,"cut":false,"hidden":false,"merged":[[1,11,1,22],[1,3,1,10]]}
[{"$f":"muni& \" - \"&S71C& \" - \"&\"A\"& \" - \"&date","v":"KZN225 Msunduzi - Table C3 Consolidated Monthly Budget Statement - Financial Performance (revenue and expenditure by municipal vote)  - A - M11 May"}]
[{"$f":"Vdesc","v":"Vote Description"},{"$f":"head27","v":"Ref"},{"$f":"Head1","v":"2022/23"},{"$f":"Head2","v":"Budget Year 2023/24"},null,null,null,null,null,null,null,{"$f":"Head4","v":{"$error":"#NAME?"}}]
["R thousand",null,{"$f":"Head5","v":"Audited Outcome"},{"$f":"Head6","v":"Original Budget"},{"$f":"Head7","v":"Adjusted Budget"},{"$f":"Head38","v":"Monthly actual"},{"$f":"Head39","v":"YearTD actual"},"YearTD budget",{"$f":"Head41","v":"YTD variance"},{"$f":"Head41","v":"YTD variance"},{"$f":"Head8","v":"Full Year Forecast"},{"$f":"Head12","v":"Forecast 2010/11"},{"$f":"Head13","v":"Forecast 2011/12"},{"$f":"Head14","v":"Forecast 2012/13"},{"$f":"Head15","v":"Forecast 2013/14"},{"$f":"Head16","v":"Forecast 2014/15"},{"$f":"Head17","v":"Forecast 2015/16"},{"$f":"Head18","v":"Forecast 2016/17"},{"$f":"Head19","v":"Forecast 2017/18"},{"$f":"Head20","v":"Forecast 2018/19"},{"$f":"Head21","v":"Forecast 2019/20"},{"$f":"Head22","v":"Forecast 2020/21"},{"$f":"Head23","v":"Forecast 2021/22"}]
[null,null,null,null,null,null,null,null,null,"%"]
["Revenue by Vote",1]
[{"$f":"'Org structure'!A2","v":"Vote 1 - City Manager"},null,{"$f":"SUM(C7:C16)","v":-14882.48},{"$f":"SUM(D7:D16)","v":0},0,0,0,0,{"$f":"G6-H6","v":0},{"$f":"IF(I6=0,\"\",I6/H6)","v":""},0]
[{"$f":"'Org structure'!E3","v":"1.1 - Internal Audit and Compliance"},null,0,null,null,null,null,{"$f":"D7/12*11","v":0},0,"",{"$f":"E7","v":0}]
[{"$f":"'Org structure'!E4","v":"1.2 - Office of the City Manager"},null,-59.990000000000009,null,null,null,null,{"$f":"D8/12*11","v":0},0,"",{"$f":"E8","v":0}]
[{"$f":"'Org structure'!E5","v":"1.3 - Political Support"},null,-14822.46,null,null,null,null,0,0,"",0]
[{"$f":"'Org structure'!E6","v":"1.4 - Strategic Planning"},null,-2.9999999999999361E-2,null,null,null,null,0,0,"",0]
[{"$f":"'Org structure'!E7","v":0},null,null,null,null,null,null,null,0,""]
[{"$f":"'Org structure'!E8","v":0},null,null,null,null,null,null,null,0,""]
[{"$f":"'Org structure'!E9","v":0},null,null,null,null,null,null,null,0,""]
[{"$f":"'Org structure'!E10","v":0},null,null,null,null,null,null,null,0,""]
[{"$f":"'Org structure'!E11","v":0},null,null,null,null,null,null,null,0,""]
[{"$f":"'Org structure'!E12","v":0},null,null,null,null,null,null,null,0,""]
[{"$f":"'Org structure'!A3","v":"Vote 2 - City Finance"},null,{"$f":"SUM(C18:C27)","v":1855452216.8800004},{"$f":"SUM(D18:D27)","v":2342934596.9894886},2596123423.8799996,136371334.77999997,1927895410.9299996,2379779805.2233329,-451884394.29333329,-0.1898849604915131,2596123423.8799996]
[{"$f":"'Org structure'!E14","v":"2.1 - Asset Management"},null,13821318.57,19067376.064750001,19067376.060000006,103845.77,29545360.769999992,{"$f":"E18/12*11","v":17478428.055000007},12066932.714999985,0.6903900440605143,{"$f":"E18","v":19067376.060000006}]
[{"$f":"'Org structure'!E15","v":"2.2 - Budget and Treasury Management"},null,399441924.22000003,787224025.28180003,787224025.27999997,3949562.29,457971117.58999997,{"$f":"E19/12*11","v":721622023.17333329},-263650905.58333331,-0.36535872952425746,787224025.27999997]
[{"$f":"'Org structure'!E16","v":"2.3 - Expenditure Management"},null,-26.13,411255.61814999999,411255.61,0,0,376984.3091666667,-376984.3091666667,-1,411255.61]
[{"$f":"'Org structure'!E17","v":"2.4 - Revenue Management"},null,1442032315.8900003,1535899000.8402884,1789087827.7499995,132316141.77,1440338816.8499997,1639997175.4374998,-199658358.5875001,-0.12174311125519928,1789087827.7499995]
[{"$f":"'Org structure'!E18","v":"2.5 - Supply Chain Management"},null,156684.32999999999,332939.18450000003,332939.18,1784.95,40115.720000000008,305194.24833333335,-265078.52833333332,-0.8685567627205556,332939.18]
[{"$f":"'Org structure'!E19","v":0},null,null,null,null,null,null,null,0,""]
[{"$f":"'Org structure'!E20","v":0},null,null,null,null,null,null,null,0,""]
[{"$f":"'Org structure'!E21","v":0},null,null,null,null,null,null,null,0,""]
[{"$f":"'Org structure'!E22","v":0},null,null,null,null,null,null,null,0,""]
[{"$f":"'Org structure'!E23","v":0},null,null,null,null,null,null,null,0,""]
[{"$f":"'Org structure'!A4","v":"Vote 3 - Corporate Services"},null,{"$f":"SUM(C29:C38)","v":8603314.8800000008},7980216.9733000007,7910911.9800000014,837363.83,5725039.290000001,7251669.3150000013,-1526630.0250000004,-0.2105211860450093,7910911.9800000014]
[{"$f":"'Org structure'!E25","v":"3.1 - Human Resources Management"},null,3375352.1100000003,2683430.2774499999,2892125.2800000003,832782.61,1740524.78,{"$f":"E29/12*11","v":2651114.8400000003},-910590.06000000029,-0.34347439283316755,{"$f":"E29","v":2892125.2800000003}]
[{"$f":"'Org structure'!E26","v":"3.2 - Information Technology"},null,-34.149999999994634,2472.4264499999999,2472.4299999999998,0,417.36,2266.3941666666665,-1849.0341666666664,-0.81584844942755974,2472.4299999999998]
[{"$f":"'Org structure'!E27","v":"3.3 - Legal Services"},null,47.550000000000068,315314.26940000005,315314.27,0,428337.14,289038.08083333331,139299.0591666667,0.48194016084333907,315314.27]
[{"$f":"'Org structure'!E28","v":"3.4 - Secretariat and Auxiliary Services"},null,-201.25,0,0,0,0,0,0,"",0]
[{"$f":"'Org structure'!E29","v":"3.5 - General Manager: Corporate Service"},null,5228150.62,4979000,4701000.0000000009,4581.22,3555760.0100000002,4309250.0000000009,-753489.99000000069,-0.17485409061901735,4701000.0000000009]
[{"$f":"'Org structure'!E30","v":0},null,null,null,null,null,null,null,0,""]
[{"$f":"'Org structure'!E31","v":0},null,null,null,null,null,null,null,0,""]
[{"$f":"'Org structure'!E32","v":0},null,null,null,null,null,null,null,0,""]
[{"$f":"'Org structure'!E33","v":0},null,null,null,null,null,null,null,0,""]
[{"$f":"'Org structure'!E34","v":0},null,null,null,null,null,null,null,0,""]
[{"$f":"'Org structure'!A5","v":"Vote 4 - Community Services and Social Equity"},null,{"$f":"SUM(C40:C49)","v":235448191.56},497013172.69024205,296214767.75000012,18907399.27,224660746.71000001,271530203.77083343,-46869457.060833424,-0.17261231498353088,296214767.75000012]
[{"$f":"'Org structure'!E36","v":"4.1 - Area Based Management "},null,660775.36999999988,9788096.7055380009,9788096.6899999976,33493.42,495014.41000000003,{"$f":"E40/12*11","v":8972421.9658333324},-8477407.5558333322,-0.94482934352786818,{"$f":"E40","v":9788096.6899999976}]
[{"$f":"'Org structure'!E37","v":"4.2 - Public Safety, Emergency Services and Enforcement"},null,24640408.620000001,8568779.0717439987,8568779.0800000001,4177043.3899999997,22322805.43,7854714.1566666663,14468091.273333333,1.841962798996776,8568779.0800000001]
[{"$f":"'Org structure'!E38","v":"4.3 - Recreation and Facilities"},null,59893752.699999996,319882193.78006005,126982913.26000011,7291465.1600000001,51241593.5,116401003.82166676,-65159410.321666762,-0.55978392094878182,126982913.26000011]
[{"$f":"'Org structure'!E39","v":"4.4 - Waste Management"},null,150253254.87,158774103.1329,150874978.72,7405397.3000000007,150601333.37,138302063.82666665,12299269.543333352,8.8930484499117599E-2,150874978.72]
[{"$f":"'Org structure'!E40","v":0},null,null,null,null,null,null,null,0,""]
[{"$f":"'Org structure'!E41","v":0},null,null,null,null,null,null,null,0,""]
[{"$f":"'Org structure'!E42","v":0},null,null,null,null,null,null,null,0,""]
[{"$f":"'Org structure'!E43","v":0},null,null,null,null,null,null,null,0,""]
[{"$f":"'Org structure'!E44","v":0},null,null,null,null,null,null,null,0,""]
[{"$f":"'Org structure'!E45","v":0},null,null,null,null,null,null,null,0,""]
[{"$f":"'Org structure'!A6","v":"Vote 5 - Infrastructure Services"},null,{"$f":"SUM(C51:C60)","v":1628015024.9400005},{"$f":"SUM(D51:D60)","v":1520657146.0191998},1473469435.2500002,52434332,1547809642.54,1350680315.6458335,197129326.89416647,0.14594817486468531,1473469435.2500002]
[{"$f":"'Org structure'!E47","v":"5.1 - Project Management Office"},null,5460715.8400000008,9830360,9020801.9800000004,879759.89,5707627.5399999991,{"$f":"E51/12*11","v":8269068.4816666674},-2561440.9416666683,-0.30976172798007817,{"$f":"E51","v":9020801.9800000004}]
[{"$f":"'Org structure'!E48","v":"5.2 - Roads and Transportation"},null,47241673.420000009,222714.29699999999,52822714.299999997,9157605.2300000004,43644582.960000001,48420821.44166667,-4776238.4816666692,-9.8640178738410689E-2,52822714.299999997]
[{"$f":"'Org structure'!E49","v":"5.3 - Water and Sanitation"},null,1575312635.6800005,1510604071.7221999,1411625918.9700003,42396966.880000003,1498457432.04,1293990425.7225001,204467006.31749988,0.15801276597802927,1411625918.9700003]
[{"$f":"'Org structure'!E50","v":"5.4 - General Manager: Infrastructure "},null,0,0,0,0,0,0,0,"",0]
[{"$f":"'Org structure'!E51","v":0},null,null,null,null,null,null,null,0,""]
[{"$f":"'Org structure'!E52","v":0},null,null,null,null,null,null,null,0,""]
[{"$f":"'Org structure'!E53","v":0},null,null,null,null,null,null,null,0,""]
[{"$f":"'Org structure'!E54","v":0},null,null,null,null,null,null,null,0,""]
[{"$f":"'Org structure'!E55","v":0},null,null,null,null,null,null,null,0,""]
[{"$f":"'Org structure'!E56","v":0},null,null,null,null,null,null,null,0,""]
[{"$f":"'Org structure'!A7","v":"Vote 6 - Sustainable Development and City Enterprises"},null,{"$f":"SUM(C62:C71)","v":248423314.13999999},{"$f":"SUM(D62:D71)","v":200280366.01151729},473092745.77999997,24668476.059999995,229056919.16999999,433668350.29833329,-204611431.1283333,-0.471815457566998,473092745.77999997]
[{"$f":"'Org structure'!E58","v":"6.1 - City Entities"},null,39317981.939999998,110066430.798112,128366894.92999998,3001782.9699999997,34897363.370000005,{"$f":"E62/12*11","v":117669653.68583331},-82772290.3158333,-0.70342936962173253,{"$f":"E62","v":128366894.92999998}]
[{"$f":"'Org structure'!E59","v":"6.2 - Development Services"},null,35447798.349999994,2292326.484033857,13306889.060000002,8809551.7199999988,15079466.619999999,12197981.638333336,2881484.9816666637,0.23622637474804181,13306889.060000002]
[{"$f":"'Org structure'!E60","v":"6.3 - Human Settlement Development"},null,55901245.099999987,32320661.282088995,197243659.32999998,10522013.659999998,81047283.729999959,180806687.71916664,-99759403.989166677,-0.55174620611442993,197243659.32999998]
[{"$f":"'Org structure'!E61","v":"6.4 - Town Planning"},null,117756288.75000001,55600947.447282434,134175302.46000001,2335127.71,98032805.450000018,122994027.255,-24961221.804999977,-0.20294661750727611,134175302.46000001]
[{"$f":"'Org structure'!E62","v":"6.5 - General Manager: Sustainable Development and City Enterprises"},null,0,0,null,0,0,0,0,"",0]
[{"$f":"'Org structure'!E63","v":0},null,null,null,null,null,null,null,0,""]
[{"$f":"'Org structure'!E64","v":0},null,null,null,null,null,null,null,0,""]
[{"$f":"'Org structure'!E65","v":0},null,null,null,null,null,null,null,0,""]
[{"$f":"'Org structure'!E66","v":0},null,null,null,null,null,null,null,{"$f":"G70-H70","v":0},{"$f":"IF(I70=0,\"\",I70/H70)","v":""}]
[{"$f":"'Org structure'!E67","v":0},null,null,null,null,null,null,null,0,""]
[{"$f":"'Org structure'!A8","v":"Vote 7 - Electricity"},null,{"$f":"SUM(C73:C82)","v":2771995265.0200005},4000560679.3162532,3598488181.3129587,-88952481.620000005,2172047912.8900023,3298614166.2035456,-1126566253.3135433,-0.34152713732207596,3598488181.3129587]
[{"$f":"'Org structure'!E69","v":"7.1 Electricity planning"},null,54061006.760000005,12000000,12000000,1195149.4900000002,23164940.079999998,{"$f":"E73/12*11","v":11000000},12164940.079999998,1.1059036436363634,{"$f":"E73","v":12000000}]
[{"$f":"'Org structure'!E70","v":"7.2 Methods and Standards"},null,0,0,0,null,null,0,0,"",0]
[{"$f":"'Org structure'!E71","v":"7.3 Operations and Maintenance"},null,0,0,0,null,null,0,0,"",0]
[{"$f":"'Org structure'!E72","v":"7.4 Revenue Management"},null,2724539631,3963821822.3851533,3561749324.3818588,-90147631.109999999,2148882972.8100023,3264936880.6833706,-1116053907.8733683,-0.34183016354048829,3561749324.3818588]
[{"$f":"'Org structure'!E73","v":"7.5 General Manager Electricity"},null,-6605372.7399999993,24738856.931099996,24738856.931099996,null,null,22677285.520174999,-22677285.520174999,-1,24738856.931099996]
[{"$f":"'Org structure'!E74","v":0},null,null,null,null,null,null,null,0,""]
[{"$f":"'Org structure'!E75","v":0},null,null,null,null,null,null,null,0,""]
[{"$f":"'Org structure'!E76","v":0},null,null,null,null,null,null,null,0,""]
[{"$f":"'Org structure'!E77","v":0},null,null,null,null,null,null,null,0,""]
[{"$f":"'Org structure'!E78","v":0},null,null,null,null,null,null,null,0,""]
[{"$f":"'Org structure'!A9","v":"Vote 8 - [NAME OF VOTE 8]"},null,{"$f":"SUM(C84:C93)","v":0},{"$f":"SUM(D84:D93)","v":0},0,0,0,0,0,"",0]
[{"$f":"'Org structure'!E80","v":"8.1 - [Name of sub-vote]"},null,null,null,null,null,null,null,0,""]
[{"$f":"'Org structure'!E81","v":0},null,null,null,null,null,null,null,0,""]
[{"$f":"'Org structure'!E82","v":0},null,null,null,null,null,null,null,0,""]
[{"$f":"'Org structure'!E83","v":0},null,null,null,null,null,null,null,0,""]
[{"$f":"'Org structure'!E84","v":0},null,null,null,null,null,null,null,0,""]
[{"$f":"'Org structure'!E85","v":0},null,null,null,null,null,null,null,0,""]
[{"$f":"'Org structure'!E86","v":0},null,null,null,null,null,null,null,0,""]
[{"$f":"'Org structure'!E87","v":0},null,null,null,null,null,null,null,0,""]
[{"$f":"'Org structure'!E88","v":0},null,null,null,null,null,null,null,0,""]
[{"$f":"'Org structure'!E89","v":0},null,null,null,null,null,null,null,0,""]
[{"$f":"'Org structure'!A10","v":"Vote 9 - [NAME OF VOTE 9]"},null,{"$f":"SUM(C95:C104)","v":0},{"$f":"SUM(D95:D104)","v":0},0,0,0,0,0,"",0]
[{"$f":"'Org structure'!E91","v":"9.1 - [Name of sub-vote]"},null,null,null,null,null,null,null,0,""]
[{"$f":"'Org structure'!E92","v":0},null,null,null,null,null,null,null,0,""]
[{"$f":"'Org structure'!E93","v":0},null,null,null,null,null,null,null,0,""]
[{"$f":"'Org structure'!E94","v":0},null,null,null,null,null,null,null,0,""]
[{"$f":"'Org structure'!E95","v":0},null,null,null,null,null,null,null,0,""]
[{"$f":"'Org structure'!E96","v":0},null,null,null,null,null,null,null,0,""]
[{"$f":"'Org structure'!E97","v":0},null,null,null,null,null,null,null,0,""]
[{"$f":"'Org structure'!E98","v":0},null,null,null,null,null,null,null,0,""]
[{"$f":"'Org structure'!E99","v":0},null,null,null,null,null,null,null,0,""]
[{"$f":"'Org structure'!E100","v":0},null,null,null,null,null,null,null,0,""]
[{"$f":"'Org structure'!A11","v":"Vote 10 - [NAME OF VOTE 10]"},null,{"$f":"SUM(C106:C115)","v":0},{"$f":"SUM(D106:D115)","v":0},0,0,0,0,0,"",0]
[{"$f":"'Org structure'!E102","v":"10.1 - [Name of sub-vote]"},null,null,null,null,null,null,null,0,""]
[{"$f":"'Org structure'!E103","v":0},null,null,null,null,null,null,null,0,""]
[{"$f":"'Org structure'!E104","v":0},null,null,null,null,null,null,null,0,""]
[{"$f":"'Org structure'!E105","v":0},null,null,null,null,null,null,null,0,""]
[{"$f":"'Org structure'!E106","v":0},null,null,null,null,null,null,null,0,""]
[{"$f":"'Org structure'!E107","v":0},null,null,null,null,null,null,null,0,""]
[{"$f":"'Org structure'!E108","v":0},null,null,null,null,null,null,null,0,""]
[{"$f":"'Org structure'!E109","v":0},null,null,null,null,null,null,null,0,""]
[{"$f":"'Org structure'!E110","v":0},null,null,null,null,null,null,null,0,""]
[{"$f":"'Org structure'!E111","v":0},null,null,null,null,null,null,null,0,""]
[{"$f":"'Org structure'!A12","v":"Vote 11 - [NAME OF VOTE 11]"},null,{"$f":"SUM(C117:C126)","v":0},{"$f":"SUM(D117:D126)","v":0},0,0,0,0,0,"",0]
[{"$f":"'Org structure'!E113","v":"11.1 - [Name of sub-vote]"},null,null,null,null,null,null,null,0,""]
[{"$f":"'Org structure'!E114","v":0},null,null,null,null,null,null,null,0,""]
[{"$f":"'Org structure'!E115","v":0},null,null,null,null,null,null,null,0,""]
[{"$f":"'Org structure'!E116","v":0},null,null,null,null,null,null,null,0,""]
[{"$f":"'Org structure'!E117","v":0},null,null,null,null,null,null,null,0,""]
[{"$f":"'Org structure'!E118","v":0},null,null,null,null,null,null,null,0,""]
[{"$f":"'Org structure'!E119","v":0},null,null,null,null,null,null,null,0,""]
[{"$f":"'Org structure'!E120","v":0},null,null,null,null,null,null,null,0,""]
[{"$f":"'Org structure'!E121","v":0},null,null,null,null,null,null,null,0,""]
[{"$f":"'Org structure'!E122","v":0},null,null,null,null,null,null,null,0,""]
[{"$f":"'Org structure'!A13","v":"Vote 12 - [NAME OF VOTE 12]"},null,{"$f":"SUM(C128:C137)","v":0},{"$f":"SUM(D128:D137)","v":0},0,0,0,0,0,"",0]
[{"$f":"'Org structure'!E124","v":"12.1 - [Name of sub-vote]"},null,null,null,null,null,null,null,0,""]
[{"$f":"'Org structure'!E125","v":0},null,null,null,null,null,null,null,0,""]
[{"$f":"'Org structure'!E126","v":0},null,null,null,null,null,null,null,0,""]
[{"$f":"'Org structure'!E127","v":0},null,null,null,null,null,null,null,0,""]
[{"$f":"'Org structure'!E128","v":0},null,null,null,null,null,null,null,0,""]
[{"$f":"'Org structure'!E129","v":0},null,null,null,null,null,null,null,0,""]
[{"$f":"'Org structure'!E130","v":0},null,null,null,null,null,null,null,{"$f":"G134-H134","v":0},{"$f":"IF(I134=0,\"\",I134/H134)","v":""}]
[{"$f":"'Org structure'!E131","v":0},null,null,null,null,null,null,null,0,""]
[{"$f":"'Org structure'!E132","v":0},null,null,null,null,null,null,null,0,""]
[{"$f":"'Org structure'!E133","v":0},null,null,null,null,null,null,null,0,""]
[{"$f":"'Org structure'!A14","v":"Vote 13 - [NAME OF VOTE 13]"},null,{"$f":"SUM(C139:C148)","v":0},{"$f":"SUM(D139:D148)","v":0},0,0,0,0,0,"",0]
[{"$f":"'Org structure'!E135","v":"13.1 - [Name of sub-vote]"},null,null,null,null,null,null,null,0,""]
[{"$f":"'Org structure'!E136","v":0},null,null,null,null,null,null,null,0,""]
[{"$f":"'Org structure'!E137","v":0},null,null,null,null,null,null,null,0,""]
[{"$f":"'Org structure'!E138","v":0},null,null,null,null,null,null,null,0,""]
[{"$f":"'Org structure'!E139","v":0},null,null,null,null,null,null,null,0,""]
[{"$f":"'Org structure'!E140","v":0},null,null,null,null,null,null,null,0,""]
[{"$f":"'Org structure'!E141","v":0},null,null,null,null,null,null,null,0,""]
[{"$f":"'Org structure'!E142","v":0},null,null,null,null,null,null,null,0,""]
[{"$f":"'Org structure'!E143","v":0},null,null,null,null,null,null,null,0,""]
[{"$f":"'Org structure'!E144","v":0},null,null,null,null,null,null,null,0,""]
[{"$f":"'Org structure'!A15","v":"Vote 14 - [NAME OF VOTE 14]"},null,{"$f":"SUM(C150:C159)","v":0},{"$f":"SUM(D150:D159)","v":0},0,0,0,0,0,"",0]
[{"$f":"'Org structure'!E146","v":"14.1 - [Name of sub-vote]"},null,null,null,null,null,null,null,0,""]
[{"$f":"'Org structure'!E147","v":0},null,null,null,null,null,null,null,0,""]
[{"$f":"'Org structure'!E148","v":0},null,null,null,null,null,null,null,0,""]
[{"$f":"'Org structure'!E149","v":0},null,null,null,null,null,null,null,0,""]
[{"$f":"'Org structure'!E150","v":0},null,null,null,null,null,null,null,0,""]
[{"$f":"'Org structure'!E151","v":0},null,null,null,null,null,null,null,0,""]
[{"$f":"'Org structure'!E152","v":0},null,null,null,null,null,null,null,0,""]
[{"$f":"'Org structure'!E153","v":0},null,null,null,null,null,null,null,0,""]
[{"$f":"'Org structure'!E154","v":0},null,null,null,null,null,null,null,0,""]
[{"$f":"'Org structure'!E155","v":0},null,null,null,null,null,null,null,0,""]
[{"$f":"'Org structure'!A16","v":"Vote 15 - [NAME OF VOTE 15]"},null,{"$f":"SUM(C161:C170)","v":0},{"$f":"SUM(D161:D170)","v":0},0,0,0,0,0,"",0]
[{"$f":"'Org structure'!E157","v":"15.1 - [Name of sub-vote]"},null,null,null,null,null,null,null,0,""]
[{"$f":"'Org structure'!E158","v":0},null,null,null,null,null,null,null,0,""]
[{"$f":"'Org structure'!E159","v":0},null,null,null,null,null,null,null,0,""]
[{"$f":"'Org structure'!E160","v":0},null,null,null,null,null,null,null,0,""]
[{"$f":"'Org structure'!E161","v":0},null,null,null,null,null,null,null,0,""]
[{"$f":"'Org structure'!E162","v":0},null,null,null,null,null,null,null,0,""]
[{"$f":"'Org structure'!E163","v":0},null,null,null,null,null,null,null,0,""]
[{"$f":"'Org structure'!E164","v":0},null,null,null,null,null,null,null,0,""]
[{"$f":"'Org structure'!E165","v":0},null,null,null,null,null,null,null,0,""]
[{"$f":"'Org structure'!E166","v":0},null,null,null,null,null,null,null,0,"",null,{"$f":"SUM(L78:L81)","v":0},0,0,0,0,0,0,0,0,0,0,0]
["Total Revenue by Vote",2,{"$f":"C6+C17+C28+C39+C50+C61+C72+C83+C94+C105+C116+C127+C138+C149+C160","v":6747922444.9400005},{"$f":"D6+D17+D28+D39+D50+D61+D72+D83+D94+D105+D116+D127+D138+D149+D160","v":8569426178},8445299465.9529581,144266424.31999999,6107195671.5300016,7741524510.4568787,-1634328838.926877,-0.21111201504552551,8445299465.9529581]
[null,null,null,null,null,null,null,null,0,""]
["Expenditure by Vote",1,null,null,null,null,null,null,0,""]
[{"$f":"'Org structure'!A2","v":"Vote 1 - City Manager"},null,{"$f":"SUM(C175:C184)","v":151981634.60999992},300105971.0701499,197403240.57999989,19595320.720000003,169406424.27000001,180952970.53166661,-11546546.261666596,-6.380965301504106E-2,197403240.57999989]
[{"$f":"'Org structure'!E3","v":"1.1 - Internal Audit and Compliance"},null,19400648.370000005,28455035.463900004,34367710.460000016,2634288.19,17211717.379999999,{"$f":"E175/12*11","v":31503734.588333346},-14292017.208333347,-0.4536610467009855,{"$f":"E175","v":34367710.460000016}]
[{"$f":"'Org structure'!E4","v":"1.2 - Office of the City Manager"},null,25450839.939999986,160808892.1931999,45551895.719999909,5594568.1400000015,31601643.639999989,41755904.409999922,-10154260.769999932,-0.24318143537966663,45551895.719999909]
[{"$f":"'Org structure'!E5","v":"1.3 - Political Support"},null,96915080.569999963,101392330.33630003,112214368.71999997,10751863.650000002,111833131.16000001,102863171.32666664,8969959.8333333731,8.7202831855602791E-2,112214368.71999997]
[{"$f":"'Org structure'!E6","v":"1.4 - Strategic Planning"},null,10215065.729999999,9449713.0767499972,5269265.6800000006,614600.74,8759932.089999998,4830160.206666667,3929771.883333331,0.8135903811035905,5269265.6800000006]
[{"$f":"'Org structure'!E7","v":0},null,null,null,null,null,null,null,0,""]
[{"$f":"'Org structure'!E8","v":0},null,null,null,null,null,null,null,0,""]
[{"$f":"'Org structure'!E9","v":0},null,null,null,null,null,null,null,0,""]
[{"$f":"'Org structure'!E10","v":0},null,null,null,null,null,null,null,0,""]
[{"$f":"'Org structure'!E11","v":0},null,null,null,null,null,null,null,0,""]
[{"$f":"'Org structure'!E12","v":0},null,null,null,null,null,null,null,0,""]
[{"$f":"'Org structure'!A3","v":"Vote 2 - City Finance"},null,{"$f":"SUM(C186:C195)","v":362344580.91999996},{"$f":"SUM(D186:D195)","v":799187822.74149001},{"$f":"SUM(E186:E195)","v":1208252870.9000001},39675503.960000008,397879930.71999991,1107565131.6583335,-709685200.93833363,-0.64076159555125867,1208252870.9000001]
[{"$f":"'Org structure'!E14","v":"2.1 - Asset Management"},null,69681320.960000008,81457538.503649995,118516081.94,6520234.5500000007,73382549.739999965,{"$f":"E186/12*11","v":108639741.77833334},-35257192.038333371,-0.32453309867278163,{"$f":"E186","v":118516081.94}]
[{"$f":"'Org structure'!E15","v":"2.2 - Budget and Treasury Management"},null,70891096.179999977,139219805.77629003,93057917.099999979,6687245.5200000005,93306561.929999992,85303090.674999982,8003471.2550000101,9.3823930547754592E-2,93057917.099999979]
[{"$f":"'Org structure'!E16","v":"2.3 - Expenditure Management"},null,39636978.729999989,43561837.159500003,52655320.979999997,7908736.5500000026,47104020.999999993,48267377.564999998,-1163356.5650000051,-2.4102336271187578E-2,52655320.979999997]
[{"$f":"'Org structure'!E17","v":"2.4 - Revenue Management"},null,86344651.329999983,459180490.14415008,908866963.24000001,15923206.400000008,112716751.26000002,833128049.63666677,-720411298.37666678,-0.86470657024552633,908866963.24000001]
[{"$f":"'Org structure'!E18","v":"2.5 - Supply Chain Management"},null,95790533.719999984,75768151.157900006,35156587.640000008,2636080.9400000009,71370046.789999962,32226872.003333338,39143174.786666624,1.2146129100775871,35156587.640000008]
[{"$f":"'Org structure'!E19","v":0},null,null,null,null,null,null,null,0,""]
[{"$f":"'Org structure'!E20","v":0},null,null,null,null,null,null,null,0,""]
[{"$f":"'Org structure'!E21","v":0},null,null,null,null,null,null,null,0,""]
[{"$f":"'Org structure'!E22","v":0},null,null,null,null,null,null,null,0,""]
[{"$f":"'Org structure'!E23","v":0},null,null,null,null,null,null,null,0,""]
[{"$f":"'Org structure'!A4","v":"Vote 3 - Corporate Services"},null,{"$f":"SUM(C197:C206)","v":163339219.33999994},195633443.38037002,158753924.93000004,39640454.899999991,187524442.74999991,145524431.18583333,42000011.564166576,0.28861141199399676,158753924.93000004]
[{"$f":"'Org structure'!E25","v":"3.1 - Human Resources Management"},null,62022384.879999958,82790450.052050024,44067840.760000028,24941138.709999997,99199232.729999915,{"$f":"E197/12*11","v":40395520.696666695},58803712.03333322,1.4556988254934291,{"$f":"E197","v":44067840.760000028}]
[{"$f":"'Org structure'!E26","v":"3.2 - Information Technology"},null,51838622.349999987,56146777.957900017,59325102.100000001,9635191.7699999996,39030742.469999999,54381343.591666669,{"$f":"G198-H198","v":-15350601.12166667},{"$f":"IF(I198=0,\"\",I198/H198)","v":-0.28227697419412379},59325102.100000001]
[{"$f":"'Org structure'!E27","v":"3.3 - Legal Services"},null,14853751.829999998,18240282.653700002,1551343.5199999996,1870722.6800000002,15189716.029999999,1422064.8933333331,13767651.136666667,9.6814506856963227,1551343.5199999996]
[{"$f":"'Org structure'!E28","v":"3.4 - Secretariat and Auxiliary Services"},null,26567553.249999996,25452722.210449994,25884797.170000006,2291510.15,26318314.829999994,23727730.73916667,2590584.0908333249,0.10917959746387057,25884797.170000006]
[{"$f":"'Org structure'!E29","v":"3.5 - General Manager: Corporate Service"},null,8056907.0299999993,13003210.506269999,27924841.379999999,901891.58999999985,7786436.6900000013,25597771.264999997,-17811334.574999996,-0.69581583453531171,27924841.379999999]
[{"$f":"'Org structure'!E30","v":0},null,null,null,null,null,null,null,0,""]
[{"$f":"'Org structure'!E31","v":0},null,null,null,null,null,null,null,0,""]
[{"$f":"'Org structure'!E32","v":0},null,null,null,null,null,null,null,0,""]
[{"$f":"'Org structure'!E33","v":0},null,null,null,null,null,null,null,0,""]
[{"$f":"'Org structure'!E34","v":0},null,null,null,null,null,null,null,0,""]
[{"$f":"'Org structure'!A5","v":"Vote 4 - Community Services and Social Equity"},null,{"$f":"SUM(C208:C217)","v":904576995.85999978},827458053.8400197,1241622856.52,74145159.920000017,787868374.91999996,1138154285.1433332,-350285910.22333324,-0.30776663128691739,1241622856.52]
[{"$f":"'Org structure'!E36","v":"4.1 - Area Based Management "},null,43684703.370000005,47703203.807950027,46204729.259999976,4109193.3600000003,44996402.270000018,{"$f":"E208/12*11","v":42354335.154999979},2642067.1150000393,6.2380087075647087E-2,{"$f":"E208","v":46204729.259999976}]
[{"$f":"'Org structure'!E37","v":"4.2 - Public Safety, Emergency Services and Enforcement"},null,407098933.31999987,321675568.57029974,143240132.86999974,31212975.859999996,315429832.11999989,131303455.1308331,184126376.9891668,1.4022965108244867,143240132.86999974]
[{"$f":"'Org structure'!E38","v":"4.3 - Recreation and Facilities"},null,310062977.21000004,326694232.86103976,243593873.00000027,27602359.640000019,296021517.31999999,223294383.58333358,72727133.736666411,0.32570068521013473,243593873.00000027]
[{"$f":"'Org structure'!E39","v":"4.4 - Waste Management"},null,143730381.95999995,131385048.60073024,808584121.38999987,11220631.060000004,131420623.21000001,741202111.27416658,-609781488.06416655,-0.82269259462296884,808584121.38999987]
[{"$f":"'Org structure'!E40","v":0},null,null,null,null,null,null,null,0,""]
[{"$f":"'Org structure'!E41","v":0},null,null,null,null,null,null,null,0,""]
[{"$f":"'Org structure'!E42","v":0},null,null,null,null,null,null,null,0,""]
[{"$f":"'Org structure'!E43","v":0},null,null,null,null,null,null,null,0,""]
[{"$f":"'Org structure'!E44","v":0},null,null,null,null,null,null,null,0,""]
[{"$f":"'Org structure'!E45","v":0},null,null,null,null,null,null,null,0,""]
[{"$f":"'Org structure'!A6","v":"Vote 5 - Infrastructure Services"},null,{"$f":"SUM(C219:C228)","v":1565729441.47},2117250005.9725699,639125706.72000003,150272266.87999997,1410615331.5499997,585865231.15999997,824750100.38999975,1.4077471345364072,639125706.72000003]
[{"$f":"'Org structure'!E47","v":"5.1 - Project Management Office"},null,8706143.1900000032,18004023.692650005,15583189.580000002,917569.05999999994,7354567.0900000017,{"$f":"E219/12*11","v":14284590.448333334},-6930023.3583333325,-0.48513980036031751,{"$f":"E219","v":15583189.580000002}]
[{"$f":"'Org structure'!E48","v":"5.2 - Roads and Transportation"},null,282991505.75999999,439116862.80299973,313910932.78999984,29075509.02,293393974.69999993,287751688.3908332,5642286.3091667295,1.9608177942306987E-2,313910932.78999984]
[{"$f":"'Org structure'!E49","v":"5.3 - Water and Sanitation"},null,1270701985.8099999,1657095302.6511202,304846824.1400001,119995656.83999997,1106605737.7299998,279442922.12833339,827162815.60166645,2.9600421055638484,304846824.1400001]
[{"$f":"'Org structure'!E50","v":"5.4 - General Manager: Infrastructure "},null,3329806.7099999995,3033816.8257999988,4784760.21,283531.95999999996,3261052.0300000003,4386030.1924999999,-1124978.1624999996,-0.25649120346314158,4784760.21]
[{"$f":"'Org structure'!E51","v":0},null,null,null,null,null,null,null,0,""]
[{"$f":"'Org structure'!E52","v":0},null,null,null,null,null,null,null,0,""]
[{"$f":"'Org structure'!E53","v":0},null,null,null,null,null,null,null,0,""]
[{"$f":"'Org structure'!E54","v":0},null,null,null,null,null,null,null,0,""]
[{"$f":"'Org structure'!E55","v":0},null,null,null,null,null,null,null,0,""]
[{"$f":"'Org structure'!E56","v":0},null,null,null,null,null,null,null,0,""]
[{"$f":"'Org structure'!A7","v":"Vote 6 - Sustainable Development and City Enterprises"},null,{"$f":"SUM(C230:C239)","v":295042335.31999993},225419326.25767064,668477444.02359974,25596241.629999992,248958823.32999992,612770990.35496652,-363812167.0249666,-0.59371636835193053,668477444.02359974]
[{"$f":"'Org structure'!E58","v":"6.1 - City Entities"},null,88328602.229999945,83895599.375880614,212329655.13999981,6425920.5099999988,80358231.129999995,{"$f":"E230/12*11","v":194635517.21166646},-114277286.08166647,-0.58713480313764999,{"$f":"E230","v":212329655.13999981}]
[{"$f":"'Org structure'!E59","v":"6.2 - Development Services"},null,16138991.59,17320417.397500001,119360365.19,4962843.0100000026,17831967.279999997,109413668.09083334,-91581700.810833335,-0.83702248913548705,119360365.19]
[{"$f":"'Org structure'!E60","v":"6.3 - Human Settlement Development"},null,78579162.179999977,25425089.556399997,143493826.82359999,4692006.1500000013,53005413.399999976,131536007.92163333,-78530594.521633357,-0.59702735214847324,143493826.82359999]
[{"$f":"'Org structure'!E61","v":"6.4 - Town Planning"},null,109455646.41999999,95782112.905590028,189558427.73000002,9439033.9699999932,95175436.449999958,173761892.08583337,-78586455.635833412,-0.45226519285951355,189558427.73000002]
[{"$f":"'Org structure'!E62","v":"6.5 - General Manager: Sustainable Development and City Enterprises"},null,2539932.9,2996107.0223000003,3735169.1400000006,76437.989999999976,2587775.0700000003,3423905.0450000004,-836129.97500000009,-0.24420361079260011,3735169.1400000006]
[{"$f":"'Org structure'!E63","v":0},null,null,null,null,null,null,null,0,""]
[{"$f":"'Org structure'!E64","v":0},null,null,null,null,null,null,null,0,""]
[{"$f":"'Org structure'!E65","v":0},null,null,null,null,null,null,null,0,""]
[{"$f":"'Org structure'!E66","v":0},null,null,null,null,null,null,null,0,""]
[{"$f":"'Org structure'!E67","v":0},null,null,null,null,null,null,null,0,""]
[{"$f":"'Org structure'!A8","v":"Vote 7 - Electricity"},null,{"$f":"SUM(C241:C250)","v":2779227938.2799997},3240145171.7377305,3450375344.8363972,238998137.63,2805973155.5800004,3162844066.1000309,-356870910.5200305,-0.11283228102992536,3450375344.8363972]
[{"$f":"'Org structure'!E69","v":"7.1 Electricity planning"},null,6454825.8400000008,35584488.520025253,31679244.760000005,2354780.2799999998,16690013.93,{"$f":"E241/12*11","v":29039307.696666673},-12349293.766666673,-0.42526130084307101,{"$f":"E241","v":31679244.760000005}]
[{"$f":"'Org structure'!E70","v":"7.2 Methods and Standards"},null,85380114.360000044,null,0,3028306.5699999984,-3653424.7800000221,0,-3653424.7800000221,{"$error":"#DIV/0!"},0]
[{"$f":"'Org structure'!E71","v":"7.3 Operations and Maintenance"},null,183129669.95999995,497036063.11125004,411551808.46999991,37728580.729999997,358886766.69000012,377255824.43083322,-18369057.740833104,-4.8691250210772877E-2,411551808.46999991]
[{"$f":"'Org structure'!E72","v":"7.4 Revenue Management"},null,2499188484.98,2568171972.8664055,2829525202.0863972,195886470.05000001,2434049799.7400002,2593731435.2458644,-159681635.50586414,-6.1564444697693864E-2,2829525202.0863972]
[{"$f":"'Org structure'!E73","v":"7.5 General Manager Electricity"},null,5074843.1399999987,139352647.24004999,177619089.51999998,null,null,162817498.72666663,-162817498.72666663,-1,177619089.51999998]
[{"$f":"'Org structure'!E74","v":0},null,null,null,null,null,null,null,0,""]
[{"$f":"'Org structure'!E75","v":0},null,null,null,null,null,null,null,0,""]
[{"$f":"'Org structure'!E76","v":0},null,null,null,null,null,null,null,0,""]
[{"$f":"'Org structure'!E77","v":0},null,null,null,null,null,null,null,0,""]
[{"$f":"'Org structure'!E78","v":0},null,null,null,null,null,null,null,0,""]
[{"$f":"'Org structure'!A9","v":"Vote 8 - [NAME OF VOTE 8]"},null,{"$f":"SUM(C252:C261)","v":0},0,0,0,0,0,0,"",0]
[{"$f":"'Org structure'!E80","v":"8.1 - [Name of sub-vote]"},null,null,null,null,null,null,null,0,""]
[{"$f":"'Org structure'!E81","v":0},null,null,null,null,null,null,null,0,""]
[{"$f":"'Org structure'!E82","v":0},null,null,null,null,null,null,null,0,""]
[{"$f":"'Org structure'!E83","v":0},null,null,null,null,null,null,null,0,""]
[{"$f":"'Org structure'!E84","v":0},null,null,null,null,null,null,null,0,""]
[{"$f":"'Org structure'!E85","v":0},null,null,null,null,null,null,null,0,""]
[{"$f":"'Org structure'!E86","v":0},null,null,null,null,null,null,null,0,""]
[{"$f":"'Org structure'!E87","v":0},null,null,null,null,null,null,null,0,""]
[{"$f":"'Org structure'!E88","v":0},null,null,null,null,null,null,null,0,""]
[{"$f":"'Org structure'!E89","v":0},null,null,null,null,null,null,null,0,""]
[{"$f":"'Org structure'!A10","v":"Vote 9 - [NAME OF VOTE 9]"},null,{"$f":"SUM(C263:C272)","v":0},0,0,0,0,0,{"$f":"G262-H262","v":0},{"$f":"IF(I262=0,\"\",I262/H262)","v":""},0]
[{"$f":"'Org structure'!E91","v":"9.1 - [Name of sub-vote]"},null,null,null,null,null,null,null,0,""]
[{"$f":"'Org structure'!E92","v":0},null,null,null,null,null,null,null,0,""]
[{"$f":"'Org structure'!E93","v":0},null,null,null,null,null,null,null,0,""]
[{"$f":"'Org structure'!E94","v":0},null,null,null,null,null,null,null,0,""]
[{"$f":"'Org structure'!E95","v":0},null,null,null,null,null,null,null,0,""]
[{"$f":"'Org structure'!E96","v":0},null,null,null,null,null,null,null,0,""]
[{"$f":"'Org structure'!E97","v":0},null,null,null,null,null,null,null,0,""]
[{"$f":"'Org structure'!E98","v":0},null,null,null,null,null,null,null,0,""]
[{"$f":"'Org structure'!E99","v":0},null,null,null,null,null,null,null,0,""]
[{"$f":"'Org structure'!E100","v":0},null,null,null,null,null,null,null,0,""]
[{"$f":"'Org structure'!A11","v":"Vote 10 - [NAME OF VOTE 10]"},null,{"$f":"SUM(C274:C283)","v":0},0,0,0,0,0,0,"",0]
[{"$f":"'Org structure'!E102","v":"10.1 - [Name of sub-vote]"},null,null,null,null,null,null,null,0,""]
[{"$f":"'Org structure'!E103","v":0},null,null,null,null,null,null,null,0,""]
[{"$f":"'Org structure'!E104","v":0},null,null,null,null,null,null,null,0,""]
[{"$f":"'Org structure'!E105","v":0},null,null,null,null,null,null,null,0,""]
[{"$f":"'Org structure'!E106","v":0},null,null,null,null,null,null,null,0,""]
[{"$f":"'Org structure'!E107","v":0},null,null,null,null,null,null,null,0,""]
[{"$f":"'Org structure'!E108","v":0},null,null,null,null,null,null,null,0,""]
[{"$f":"'Org structure'!E109","v":0},null,null,null,null,null,null,null,0,""]
[{"$f":"'Org structure'!E110","v":0},null,null,null,null,null,null,null,0,""]
[{"$f":"'Org structure'!E111","v":0},null,null,null,null,null,null,null,0,""]
[{"$f":"'Org structure'!A12","v":"Vote 11 - [NAME OF VOTE 11]"},null,{"$f":"SUM(C285:C294)","v":0},0,0,0,0,0,0,"",0]
[{"$f":"'Org structure'!E113","v":"11.1 - [Name of sub-vote]"},null,null,null,null,null,null,null,0,""]
[{"$f":"'Org structure'!E114","v":0},null,null,null,null,null,null,null,0,""]
[{"$f":"'Org structure'!E115","v":0},null,null,null,null,null,null,null,0,""]
[{"$f":"'Org structure'!E116","v":0},null,null,null,null,null,null,null,0,""]
[{"$f":"'Org structure'!E117","v":0},null,null,null,null,null,null,null,0,""]
[{"$f":"'Org structure'!E118","v":0},null,null,null,null,null,null,null,0,""]
[{"$f":"'Org structure'!E119","v":0},null,null,null,null,null,null,null,0,""]
[{"$f":"'Org structure'!E120","v":0},null,null,null,null,null,null,null,0,""]
[{"$f":"'Org structure'!E121","v":0},null,null,null,null,null,null,null,0,""]
[{"$f":"'Org structure'!E122","v":0},null,null,null,null,null,null,null,0,""]
[{"$f":"'Org structure'!A13","v":"Vote 12 - [NAME OF VOTE 12]"},null,{"$f":"SUM(C296:C305)","v":0},0,0,0,0,0,0,"",0]
[{"$f":"'Org structure'!E124","v":"12.1 - [Name of sub-vote]"},null,null,null,null,null,null,null,0,""]
[{"$f":"'Org structure'!E125","v":0},null,null,null,null,null,null,null,0,""]
[{"$f":"'Org structure'!E126","v":0},null,null,null,null,null,null,null,0,""]
[{"$f":"'Org structure'!E127","v":0},null,null,null,null,null,null,null,0,""]
[{"$f":"'Org structure'!E128","v":0},null,null,null,null,null,null,null,0,""]
[{"$f":"'Org structure'!E129","v":0},null,null,null,null,null,null,null,0,""]
[{"$f":"'Org structure'!E130","v":0},null,null,null,null,null,null,null,0,""]
[{"$f":"'Org structure'!E131","v":0},null,null,null,null,null,null,null,0,""]
[{"$f":"'Org structure'!E132","v":0},null,null,null,null,null,null,null,0,""]
[{"$f":"'Org structure'!E133","v":0},null,null,null,null,null,null,null,0,""]
[{"$f":"'Org structure'!A14","v":"Vote 13 - [NAME OF VOTE 13]"},null,{"$f":"SUM(C307:C316)","v":0},0,0,0,0,0,0,"",0]
[{"$f":"'Org structure'!E135","v":"13.1 - [Name of sub-vote]"},null,null,null,null,null,null,null,0,""]
[{"$f":"'Org structure'!E136","v":0},null,null,null,null,null,null,null,0,""]
[{"$f":"'Org structure'!E137","v":0},null,null,null,null,null,null,null,0,""]
[{"$f":"'Org structure'!E138","v":0},null,null,null,null,null,null,null,0,""]
[{"$f":"'Org structure'!E139","v":0},null,null,null,null,null,null,null,0,""]
[{"$f":"'Org structure'!E140","v":0},null,null,null,null,null,null,null,0,""]
[{"$f":"'Org structure'!E141","v":0},null,null,null,null,null,null,null,0,""]
[{"$f":"'Org structure'!E142","v":0},null,null,null,null,null,null,null,0,""]
[{"$f":"'Org structure'!E143","v":0},null,null,null,null,null,null,null,0,""]
[{"$f":"'Org structure'!E144","v":0},null,null,null,null,null,null,null,0,""]
[{"$f":"'Org structure'!A15","v":"Vote 14 - [NAME OF VOTE 14]"},null,{"$f":"SUM(C318:C327)","v":0},0,0,0,0,0,0,"",0]
[{"$f":"'Org structure'!E146","v":"14.1 - [Name of sub-vote]"},null,null,null,null,null,null,null,0,""]
[{"$f":"'Org structure'!E147","v":0},null,null,null,null,null,null,null,0,""]
[{"$f":"'Org structure'!E148","v":0},null,null,null,null,null,null,null,0,""]
[{"$f":"'Org structure'!E149","v":0},null,null,null,null,null,null,null,0,""]
[{"$f":"'Org structure'!E150","v":0},null,null,null,null,null,null,null,0,""]
[{"$f":"'Org structure'!E151","v":0},null,null,null,null,null,null,null,0,""]
[{"$f":"'Org structure'!E152","v":0},null,null,null,null,null,null,null,0,""]
[{"$f":"'Org structure'!E153","v":0},null,null,null,null,null,null,null,0,""]
[{"$f":"'Org structure'!E154","v":0},null,null,null,null,null,null,null,{"$f":"G326-H326","v":0},{"$f":"IF(I326=0,\"\",I326/H326)","v":""}]
[{"$f":"'Org structure'!E155","v":0},null,null,null,null,null,null,null,0,""]
[{"$f":"'Org structure'!A16","v":"Vote 15 - [NAME OF VOTE 15]"},null,{"$f":"SUM(C329:C338)","v":0},0,0,0,0,0,0,"",0]
[{"$f":"'Org structure'!E157","v":"15.1 - [Name of sub-vote]"},null,null,null,null,null,null,null,0,""]
[{"$f":"'Org structure'!E158","v":0},null,null,null,null,null,null,null,0,""]
[{"$f":"'Org structure'!E159","v":0},null,null,null,null,null,null,null,0,""]
[{"$f":"'Org structure'!E160","v":0},null,null,null,null,null,null,null,0,""]
[{"$f":"'Org structure'!E161","v":0},null,null,null,null,null,null,null,0,""]
[{"$f":"'Org structure'!E162","v":0},null,null,null,null,null,null,null,0,""]
[{"$f":"'Org structure'!E163","v":0},null,null,null,null,null,null,null,0,""]
[{"$f":"'Org structure'!E164","v":0},null,null,null,null,null,null,null,0,""]
[{"$f":"'Org structure'!E165","v":0},null,null,null,null,null,null,null,0,""]
[{"$f":"'Org structure'!E166","v":0},null,null,null,null,null,null,null,0,"",null,{"$f":"SUM(L173:L249)","v":0},0,0,0,0,0,0,0,0,0,0,0]
["Total Expenditure by Vote",2,{"$f":"C174+C185+C196+C207+C218+C229+C240+C251+C262++C273+C284+C295+C306+C317+C328","v":6222242145.7999992},7705199795,7564011388.5099974,587923085.63999999,6008226483.1199999,6933677106.1341648,-925450623.01416492,-0.13347183735963514,{"$f":"K174+K185+K196+K207+K218+K229+K240+K251+K262++K273+K284+K295+K306+K317+K328","v":7564011388.5099974}]
[null,null,null,null,null,null,null,null,0,"",null,{"$f":"L170-L338","v":0},0,0,0,0,0,0,0,0,0,0,0]
[{"$f":"result","v":"Surplus/ (Deficit) for the year"},2,{"$f":"C171-C339","v":525680299.1400013},864226383,881288077.44296074,-443656661.31999999,98969188.410001755,807847404.32271385,-708878215.9127121,-0.8774902439737664,{"$f":"K171-K339","v":881288077.44296074}]
[{"$f":"head27a","v":"References"}]
["1. Insert 'Vote'; e.g. Department, if different to standard structure"]
["2. Must reconcile to Financial Performance ('Revenue and Expenditure by Standard Classification' and 'Revenue and Expenditure')"]
["3. Assign share in 'associate' to relevant Vote"]
[]
["check revenue"]
["check expenditure"]

{"sheet":"C4-FinPerf RE","index":11,"n_rows":65,"n_cols":11,"rows_kept":65,"cut":false,"hidden":false,"merged":[[1,0,2,0],[1,1,2,1],[1,3,1,10],[0,0,0,10]]}
[{"$f":"muni& \" - \"&S71B& \" - \"&date","v":"KZN225 Msunduzi - Table C4 Consolidated Monthly Budget Statement - Financial Performance (revenue and expenditure)  - M11 May"}]
[{"$f":"desc","v":"Description"},{"$f":"head27","v":"Ref"},{"$f":"Head1","v":"2022/23"},{"$f":"Head2","v":"Budget Year 2023/24"}]
[null,null,{"$f":"Head5","v":"Audited Outcome"},{"$f":"Head6","v":"Original Budget"},{"$f":"Head7","v":"Adjusted Budget"},{"$f":"Head38","v":"Monthly actual"},{"$f":"Head39","v":"YearTD actual"},"YearTD budget",{"$f":"Head41","v":"YTD variance"},{"$f":"Head41","v":"YTD variance"},{"$f":"Head8","v":"Full Year Forecast"}]
["R thousands",null,null,null,null,null,null,null,null,"%"]
["Revenue"]
["Exchange Revenue"]
["Service charges - Electricity ",null,2724539631,3892818095.6607995,3673354756.4900575,-92356424.5,2135205618.95,{"$f":"E7/12*11","v":3367241860.1158857},{"$f":"G7-H7","v":-1232036241.1658857},{"$f":"IF(I7=0,\"\",I7/H7)","v":-0.36588884682120348},{"$f":"E7","v":3673354756.4900575}]
["Service charges - Water ",null,824368756,901571501.7650001,901571501.7650001,10724566.279999994,688939883.78999996,{"$f":"E8/12*11","v":826440543.28458333},-137500659.49458337,-0.16637695308134859,{"$f":"E8","v":901571501.7650001}]
["Service charges - Waste Water Management",null,197959736,202499871.93920001,202499871.93920001,4598530.49,177251976.72,185624882.61093336,-8372905.8909333646,-4.5106592247564324E-2,202499871.93920001]
["Service charges - Waste management",null,123629075,138741765.12349999,138741765.12349999,6601718.2400000002,114594181.60000001,127179951.36320832,-12585769.763208315,-9.896032848184616E-2,138741765.12349999]
["Sale of Goods and Rendering of Services",null,null,null,0,0,0,0,0,"",0]
["Agency services",null,2598950,714790.32380000001,714790.32380000001,636738,3226607,655224.46348333335,2571382.5365166664,3.9244299928097441,714790.32380000001]
["Interest",null,null,null,0,0,0,0,0,"",0]
["Interest earned from Receivables",null,221878154.42999998,198174144,198174144,35554245.37000002,343702629.01999992,181659632,162042997.01999992,0.89201434152415282,198174144]
["Interest from Current and Non Current Assets",null,null,null,null,0,0,0,0,"",0]
["Dividends",null,null,null,null,0,0,0,0,"",0]
["Rent on Land",null,null,null,null,0,0,0,0,"",0]
["Rental from Fixed Assets",null,20071337.020000007,104823531.74793798,104823531.74793798,1631243.8599999999,27744558.259999998,96088237.435609818,-68343679.175609827,-0.71125957765026093,104823531.74793798]
["Licence and permits",null,2415455.89,2451743.9566758568,2451743.9566758568,108099.68,1919774.97,2247431.9602862019,-327656.99028620194,-0.14579172854891503,2451743.9566758568]
["Operational Revenue",null,68505983,230407182.35087389,230407182.35087389,4936819.9000000004,73579692.600000009,211206583.82163441,-137626891.22163439,-0.65162216409816731,230407182.35087389]
["Non-Exchange Revenue",null,null,null,null,0,0,0,0,"",0]
["Property rates",null,1370173436,1526985081.6338,1526985081.6338,123177547.8,1287594364.2099998,1399736324.8309834,-112141960.6209836,-8.0116489535644944E-2,1526985081.6338]
["Surcharges and Taxes",null,null,null,0,0,0,0,0,"",0]
["Fines, penalties and forfeits",null,20129364.789999999,14659914.477071574,14659914.477071574,3674035.55,31378563.359999999,13438254.937315609,17940308.42268439,1.3350177166878558,14659914.477071574]
["Licence and permits",null,null,null,null,0,0,0,0,"",0]
["Transfers and subsidies - Operational",null,801751325,838135150,846015625.88,7062702.5299999993,817373542.76999986,775514323.72333336,41859219.046666503,5.3976074672219571E-2,846015625.88]
["Interest",null,16957184.810000002,68743352.281800002,68743352.281800002,4421313.24,38841623.079999998,63014739.591650002,-24173116.511650003,-0.3836105118944767,68743352.281800002]
["Fuel Levy",null,null,null,0,null,null,null,0,"",{"$f":"D28","v":0}]
["Operational Revenue",null,null,null,0,null,null,null,0,"",0]
["Gains on disposal of Assets",null,null,null,0,null,null,null,0,"",0]
["Other Gains",null,28624786,null,0,null,null,null,0,"",0]
["Discontinued Operations",null,null,null,0,null,null,null,0,"",0]
["Total Revenue (excluding capital transfers and contributions)",null,{"$f":"SUM(C7:C20)+SUM(C22:C32)","v":6423603174.9399996},{"$f":"SUM(D7:D20)+SUM(D22:D32)","v":8120726125.260458},7909143261.969717,110771136.44000001,5741353016.329999,7250047990.1389074,-1508694973.8089085,-0.20809448101046329,{"$f":"SUM(K7:K20)+SUM(K22:K32)","v":7909143261.969717}]
["Expenditure By Type"]
["Employee related costs",null,1466855856,1793148355,1716571721.6399972,125140895.89000003,1433891584.5099978,{"$f":"E35/12*11","v":1573524078.1699975},-139632493.65999961,{"$f":"IF(I35=0,\"\",I35/H35)","v":-8.8738707972229866E-2},{"$f":"E35","v":1716571721.6399972}]
["Remuneration of councillors",null,51817506.850000001,62699934.989999995,62699934.989999995,4719825.7600000007,58539389.640000008,57474940.407499999,1064449.2325000092,1.8520232034222477E-2,62699934.989999995]
["Bulk purchases - electricity",null,2350400904.9499998,2514000000,2714000000,193382044.99000001,2384133018.4700003,2487833333.333333,-103700314.86333275,-4.1682983129898613E-2,2714000000]
["Inventory consumed",null,739336381,970629036,878190465.65999961,83888277.819999993,780963916.43999982,805007926.85499954,-24044010.414999723,-2.9868041807904585E-2,878190465.65999961]
["Debt impairment",null,71195569,600000000,600000000,5048248.8,20572779.620000001,550000000,-529427220.38,-0.96259494614545449,600000000]
["Depreciation and amortisation",null,350683902,461615984,462450178.23999989,31765602.540000003,335254486.78000003,423912663.38666654,-88658176.606666505,-0.20914255285126521,462450178.23999989]
["Interest",null,143221895,40400879.723359942,40400879.723359942,1943046.92,60989928.900000006,37034139.746413276,23955789.15358673,0.64685690872316881,40400879.723359942]
["Contracted services",null,799398801,994887837,855790559.6400001,92892251.940000027,702470082.0200001,784474679.6700002,-82004597.650000095,-0.10453440980975502,855790559.6400001]
["Transfers and subsidies",null,29562255,51023535.286639996,14626601.039999999,4601219.6500000013,45635538.919999987,13407717.619999999,32227821.29999999,2.4036769130583755,14626601.039999999]
["Irrecoverable debts written off",null,null,null,0,0,0,0,0]
["Operational costs",null,186190577,216794233,219281049.24999985,44541671.329999961,185775757.81999981,201007628.47916654,-15231870.659166723,-7.5777575082158793E-2,{"$f":"E45","v":219281049.24999985}]
["Losses on Disposal of Assets",null,null,null,0,0,0,null,0,""]
["Other Losses",null,33578498,null,0,0,0,null,0]
["Total Expenditure",null,{"$f":"SUM(C35:C47)","v":6222242145.7999992},{"$f":"SUM(D35:D47)","v":7705199795},7564011390.1833572,587923085.63999999,6008226483.119997,6933677107.6680765,{"$f":"G48-H48","v":-925450624.54807949},-0.13347183755133438,{"$f":"SUM(K35:K47)","v":7564011390.1833572}]
["Surplus/(Deficit)",null,{"$f":"C33-C48","v":201361029.14000034},415526330.26045799,345131871.78635979,-477151949.19999999,-266873466.78999805,316370882.47083092,-583244349.26082897,-1.8435462350572149,{"$f":"K33-K48","v":345131871.78635979}]
["Transfers and subsidies - capital (monetary allocations)",null,324319270,448700054.94999999,536156203.44999993,33495287.880000003,365842655.19999999,{"$f":"E50/12*11","v":491476519.82916665},{"$f":"G50-H50","v":-125633864.62916666},-0.25562536471291852,{"$f":"E50","v":536156203.44999993}]
["Transfers and subsidies - capital (in-kind)",null,null,null,null,null,null,null,{"$f":"G51-H51","v":0},""]
["Surplus/(Deficit) after capital transfers & contributions",null,{"$f":"C49+SUM(C50:C51)","v":525680299.14000034},864226385.21045804,881288075.23635972,-443656661.31999999,98969188.410001934,807847402.29999757,null,null,{"$f":"K49+SUM(K50:K51)","v":881288075.23635972}]
["Income Tax",null,null,null,null,null,null,null,null,{"$f":"IF(I53=0,\"\",I53/H53)","v":""}]
["Surplus/(Deficit) after income tax",null,{"$f":"C52-C53","v":525680299.14000034},864226385.21045804,881288075.23635972,-443656661.31999999,98969188.410001934,807847402.29999757,null,null,{"$f":"K52-K53","v":881288075.23635972}]
["Share of Surplus/Deficit attributable to Joint Venture"]
["Share of Surplus/Deficit attributable to Minorities"]
["Surplus/(Deficit) attributable to municipality",null,{"$f":"SUM(C54:C55)","v":525680299.14000034},864226385.21045804,881288075.23635972,-443656661.31999999,98969188.410001934,807847402.29999757,null,null,{"$f":"SUM(K54:K55)","v":881288075.23635972}]
["Share of Surplus/Deficit attributable to Associate"]
["Intercompany/Parent subsidiary transactions"]
["Surplus/ (Deficit) for the year",null,{"$f":"C57+C59","v":525680299.14000034},864226385.21045804,881288075.23635972,-443656661.31999999,98969188.410001934,807847402.29999757,null,null,{"$f":"K57+K59","v":881288075.23635972}]
[{"$f":"head27a","v":"References"}]
["1. Material variances to be explained on Table SC1"]
[]
[]
[{"$f":"A33&\" including capital transfers/contributions etc\"","v":"Total Revenue (excluding capital transfers and contributions) including capital transfers/contributions etc"},null,{"$f":"C33+SUM(C50:C51)","v":6747922444.9399996},8569426180.2104578,8445299465.4197168,144266424.32000002,6107195671.5299988,7741524509.9680738,-1634328838.4380751,null,{"$f":"K33+SUM(K50:K51)","v":8445299465.4197168}]

{"sheet":"C5-Capex","index":12,"n_rows":86,"n_cols":11,"rows_kept":86,"cut":false,"hidden":false,"merged":[[0,0,0,10],[76,0,76,10],[78,0,78,10],[77,0,77,10],[1,0,2,0],[1,1,2,1]]}
[{"$f":"muni& \" - \"&S71D& \" - \"&date","v":"KZN225 Msunduzi - Table C5 Consolidated Monthly Budget Statement - Capital Expenditure (municipal vote, functional classification and funding  - M11 May"}]
[{"$f":"Vdesc","v":"Vote Description"},{"$f":"head27","v":"Ref"},{"$f":"Head1","v":"2022/23"},{"$f":"Head2","v":"Budget Year 2023/24"}]
[null,null,{"$f":"Head5","v":"Audited Outcome"},{"$f":"Head6","v":"Original Budget"},{"$f":"Head7","v":"Adjusted Budget"},{"$f":"Head38","v":"Monthly actual"},{"$f":"Head39","v":"YearTD actual"},"YearTD budget",{"$f":"Head41","v":"YTD variance"},{"$f":"Head41","v":"YTD variance"},{"$f":"Head8","v":"Full Year Forecast"}]
["R thousands",1,null,null,null,null,null,null,null,"%"]
["Multi-Year expenditure appropriation",2]
[{"$f":"'Org structure'!A2","v":"Vote 1 - City Manager"},null,{"$f":"'C5C'!C7","v":27000},{"$f":"'C5C'!D7","v":0},{"$f":"'C5C'!E7","v":0},{"$f":"'C5C'!F7","v":0},{"$f":"'C5C'!G7","v":0},{"$f":"'C5C'!H7","v":0},{"$f":"G6-H6","v":0},{"$f":"IF(I6=0,\"\",I6/H6)","v":""},{"$f":"'C5C'!K7","v":0}]
[{"$f":"'Org structure'!A3","v":"Vote 2 - City Finance"},null,{"$f":"'C5C'!C18","v":9153029.5299999993},{"$f":"'C5C'!D18","v":30000000},{"$f":"'C5C'!E18","v":30000000},{"$f":"'C5C'!F18","v":0},{"$f":"'C5C'!G18","v":5771250},{"$f":"'C5C'!H18","v":27500000},{"$f":"G7-H7","v":-21728750},{"$f":"IF(I7=0,\"\",I7/H7)","v":-0.79013636363636364},{"$f":"'C5C'!K18","v":30000000}]
[{"$f":"'Org structure'!A4","v":"Vote 3 - Corporate Services"},null,{"$f":"'C5C'!C29","v":937669.79},{"$f":"'C5C'!D29","v":10000000},{"$f":"'C5C'!E29","v":3318000},{"$f":"'C5C'!F29","v":275993.05},{"$f":"'C5C'!G29","v":1580186.73},{"$f":"'C5C'!H29","v":3041500},{"$f":"G8-H8","v":-1461313.27},{"$f":"IF(I8=0,\"\",I8/H8)","v":-0.48045808647049154},{"$f":"'C5C'!K29","v":3318000}]
[{"$f":"'Org structure'!A5","v":"Vote 4 - Community Services and Social Equity"},null,{"$f":"'C5C'!C40","v":48934490.920000002},{"$f":"'C5C'!D40","v":24886499.049999952},{"$f":"'C5C'!E40","v":68123568},{"$f":"'C5C'!F40","v":10479741.449999999},{"$f":"'C5C'!G40","v":46548305.859999999},{"$f":"'C5C'!H40","v":62446604},-15898298.140000001,-0.25459027587793248,{"$f":"'C5C'!K40","v":68123568}]
[{"$f":"'Org structure'!A6","v":"Vote 5 - Infrastructure Services"},null,{"$f":"'C5C'!C51","v":268923267.12999994},{"$f":"'C5C'!D51","v":318102140},{"$f":"'C5C'!E51","v":237994494},{"$f":"'C5C'!F51","v":24219216.929999996},{"$f":"'C5C'!G51","v":222521204.44999999},{"$f":"'C5C'!H51","v":218161619.5},4359584.9499999881,1.9983281018868621E-2,{"$f":"'C5C'!K51","v":237994494}]
[{"$f":"'Org structure'!A7","v":"Vote 6 - Sustainable Development and City Enterprises"},null,{"$f":"'C5C'!C62","v":133279407.06},{"$f":"'C5C'!D62","v":144745414.94999999},{"$f":"'C5C'!E62","v":266966935.44999999},{"$f":"'C5C'!F62","v":13917362.5},{"$f":"'C5C'!G62","v":151148626.56999999},{"$f":"'C5C'!H62","v":244719690.82916668},-93571064.259166688,-0.38236017682976947,{"$f":"'C5C'!K62","v":266966935.44999999}]
[{"$f":"'Org structure'!A8","v":"Vote 7 - Electricity"},null,{"$f":"'C5C'!C73","v":71071450.300000012},{"$f":"'C5C'!D73","v":175400000},{"$f":"'C5C'!E73","v":141974950},{"$f":"'C5C'!F73","v":16308788.649999999},{"$f":"'C5C'!G73","v":56641862.310000002},{"$f":"'C5C'!H73","v":130143704.16666667},-73501841.856666669,-0.56477447239812373,{"$f":"'C5C'!K73","v":141974950}]
[{"$f":"'Org structure'!A9","v":"Vote 8 - [NAME OF VOTE 8]"},null,{"$f":"'C5C'!C84","v":0},{"$f":"'C5C'!D84","v":0},{"$f":"'C5C'!E84","v":0},{"$f":"'C5C'!F84","v":0},{"$f":"'C5C'!G84","v":0},0,0,"",{"$f":"'C5C'!K84","v":0}]
[{"$f":"'Org structure'!A10","v":"Vote 9 - [NAME OF VOTE 9]"},null,{"$f":"'C5C'!C95","v":0},{"$f":"'C5C'!D95","v":0},{"$f":"'C5C'!E95","v":0},{"$f":"'C5C'!F95","v":0},{"$f":"'C5C'!G95","v":0},0,0,"",{"$f":"'C5C'!K95","v":0}]
[{"$f":"'Org structure'!A11","v":"Vote 10 - [NAME OF VOTE 10]"},null,{"$f":"'C5C'!C106","v":0},{"$f":"'C5C'!D106","v":0},{"$f":"'C5C'!E106","v":0},{"$f":"'C5C'!F106","v":0},{"$f":"'C5C'!G106","v":0},0,0,"",{"$f":"'C5C'!K106","v":0}]
[{"$f":"'Org structure'!A12","v":"Vote 11 - [NAME OF VOTE 11]"},null,{"$f":"'C5C'!C117","v":0},{"$f":"'C5C'!D117","v":0},{"$f":"'C5C'!E117","v":0},{"$f":"'C5C'!F117","v":0},{"$f":"'C5C'!G117","v":0},0,0,"",{"$f":"'C5C'!K117","v":0}]
[{"$f":"'Org structure'!A13","v":"Vote 12 - [NAME OF VOTE 12]"},null,{"$f":"'C5C'!C128","v":0},{"$f":"'C5C'!D128","v":0},{"$f":"'C5C'!E128","v":0},{"$f":"'C5C'!F128","v":0},{"$f":"'C5C'!G128","v":0},0,0,"",{"$f":"'C5C'!K128","v":0}]
[{"$f":"'Org structure'!A14","v":"Vote 13 - [NAME OF VOTE 13]"},null,{"$f":"'C5C'!C139","v":0},{"$f":"'C5C'!D139","v":0},{"$f":"'C5C'!E139","v":0},{"$f":"'C5C'!F139","v":0},{"$f":"'C5C'!G139","v":0},0,{"$f":"G18-H18","v":0},{"$f":"IF(I18=0,\"\",I18/H18)","v":""},{"$f":"'C5C'!K139","v":0}]
[{"$f":"'Org structure'!A15","v":"Vote 14 - [NAME OF VOTE 14]"},null,{"$f":"'C5C'!C150","v":0},{"$f":"'C5C'!D150","v":0},{"$f":"'C5C'!E150","v":0},{"$f":"'C5C'!F150","v":0},{"$f":"'C5C'!G150","v":0},0,{"$f":"G19-H19","v":0},{"$f":"IF(I19=0,\"\",I19/H19)","v":""},{"$f":"'C5C'!K150","v":0}]
[{"$f":"'Org structure'!A16","v":"Vote 15 - [NAME OF VOTE 15]"},null,{"$f":"'C5C'!C161","v":0},{"$f":"'C5C'!D161","v":0},{"$f":"'C5C'!E161","v":0},{"$f":"'C5C'!F161","v":0},{"$f":"'C5C'!G161","v":0},0,{"$f":"G20-H20","v":0},{"$f":"IF(I20=0,\"\",I20/H20)","v":""},{"$f":"'C5C'!K161","v":0}]
["Total Capital Multi-year expenditure","4,7",{"$f":"SUM(C6:C20)","v":532326314.72999996},{"$f":"SUM(D6:D20)","v":703134054},748377947.45000005,65201102.579999991,484211435.91999996,686013118.49583328,-201801682.57583338,{"$f":"IF(I21=0,\"\",I21/H21)","v":-0.29416592355887883},{"$f":"SUM(K6:K20)","v":748377947.45000005}]
[]
["Single Year expenditure appropriation",2]
[{"$f":"'Org structure'!A2","v":"Vote 1 - City Manager"},null,{"$f":"'C5C'!C176","v":943953.22},{"$f":"'C5C'!D176","v":5000000},{"$f":"'C5C'!E176","v":7700000},{"$f":"'C5C'!F176","v":154922.1},{"$f":"'C5C'!G176","v":3133548.93},{"$f":"'C5C'!H176","v":7058333.333333334},{"$f":"'C5C'!I176","v":-3924784.4033333338},{"$f":"IF(I24=0,\"\",I24/H24)","v":-0.55604973837072025},{"$f":"'C5C'!K176","v":7700000}]
[{"$f":"'Org structure'!A3","v":"Vote 2 - City Finance"},null,{"$f":"'C5C'!C187","v":3084194.2200000007},{"$f":"'C5C'!D187","v":0},{"$f":"'C5C'!E187","v":0},{"$f":"'C5C'!F187","v":2499},{"$f":"'C5C'!G187","v":2499},{"$f":"'C5C'!H187","v":0},{"$f":"'C5C'!I187","v":2499},{"$f":"IF(I25=0,\"\",I25/H25)","v":{"$error":"#DIV/0!"}},{"$f":"'C5C'!K187","v":0}]
[{"$f":"'Org structure'!A4","v":"Vote 3 - Corporate Services"},null,{"$f":"'C5C'!C198","v":3796496.8200000003},{"$f":"'C5C'!D198","v":10000000},{"$f":"'C5C'!E198","v":17000000},{"$f":"'C5C'!F198","v":549010.84},{"$f":"'C5C'!G198","v":13057235.959999999},{"$f":"'C5C'!H198","v":15583333.333333334},{"$f":"'C5C'!I198","v":-2526097.3733333349},-0.16210250524064182,{"$f":"'C5C'!K198","v":17000000}]
[{"$f":"'Org structure'!A5","v":"Vote 4 - Community Services and Social Equity"},null,{"$f":"'C5C'!C209","v":4980126},{"$f":"'C5C'!D209","v":4000000},{"$f":"'C5C'!E209","v":4229800},{"$f":"'C5C'!F209","v":27832.99},{"$f":"'C5C'!G209","v":2597064.9500000002},{"$f":"'C5C'!H209","v":3877316.6666666665},{"$f":"'C5C'!I209","v":-1280251.7166666663},-0.33019013578978584,{"$f":"'C5C'!K209","v":4229800}]
[{"$f":"'Org structure'!A6","v":"Vote 5 - Infrastructure Services"},null,{"$f":"'C5C'!C220","v":792613.81},{"$f":"'C5C'!D220","v":5000000},{"$f":"'C5C'!E220","v":19850000},{"$f":"'C5C'!F220","v":0},{"$f":"'C5C'!G220","v":10011134.26},{"$f":"'C5C'!H220","v":18195833.333333336},{"$f":"'C5C'!I220","v":-8184699.073333336},-0.44981171916647594,{"$f":"'C5C'!K220","v":19850000}]
[{"$f":"'Org structure'!A7","v":"Vote 6 - Sustainable Development and City Enterprises"},null,{"$f":"'C5C'!C231","v":1035306.98},{"$f":"'C5C'!D231","v":38026000},{"$f":"'C5C'!E231","v":1386206},{"$f":"'C5C'!F231","v":172782.5},{"$f":"'C5C'!G231","v":192972.5},{"$f":"'C5C'!H231","v":1270688.8333333333},{"$f":"'C5C'!I231","v":-1077716.3333333333},-0.84813551914689844,{"$f":"'C5C'!K231","v":1386206}]
[{"$f":"'Org structure'!A8","v":"Vote 7 - Electricity"},null,{"$f":"'C5C'!C242","v":830822.31},{"$f":"'C5C'!D242","v":3600000},{"$f":"'C5C'!E242","v":4000000},{"$f":"'C5C'!F242","v":199651.8},{"$f":"'C5C'!G242","v":199651.8},{"$f":"'C5C'!H242","v":3666666.6666666665},{"$f":"'C5C'!I242","v":-3467014.8666666667},-0.94554950909090918,{"$f":"'C5C'!K242","v":4000000}]
[{"$f":"'Org structure'!A9","v":"Vote 8 - [NAME OF VOTE 8]"},null,{"$f":"'C5C'!C253","v":0},{"$f":"'C5C'!D253","v":0},{"$f":"'C5C'!E253","v":0},{"$f":"'C5C'!F253","v":0},{"$f":"'C5C'!G253","v":0},0,{"$f":"'C5C'!I253","v":0},"",{"$f":"'C5C'!K253","v":0}]
[{"$f":"'Org structure'!A10","v":"Vote 9 - [NAME OF VOTE 9]"},null,{"$f":"'C5C'!C264","v":0},{"$f":"'C5C'!D264","v":0},{"$f":"'C5C'!E264","v":0},{"$f":"'C5C'!F264","v":0},{"$f":"'C5C'!G264","v":0},0,{"$f":"'C5C'!I264","v":0},"",{"$f":"'C5C'!K264","v":0}]
[{"$f":"'Org structure'!A11","v":"Vote 10 - [NAME OF VOTE 10]"},null,{"$f":"'C5C'!C275","v":0},{"$f":"'C5C'!D275","v":0},{"$f":"'C5C'!E275","v":0},{"$f":"'C5C'!F275","v":0},{"$f":"'C5C'!G275","v":0},0,{"$f":"'C5C'!I275","v":0},"",{"$f":"'C5C'!K275","v":0}]
[{"$f":"'Org structure'!A12","v":"Vote 11 - [NAME OF VOTE 11]"},null,{"$f":"'C5C'!C286","v":0},{"$f":"'C5C'!D286","v":0},{"$f":"'C5C'!E286","v":0},{"$f":"'C5C'!F286","v":0},{"$f":"'C5C'!G286","v":0},0,{"$f":"'C5C'!I286","v":0},"",{"$f":"'C5C'!K286","v":0}]
[{"$f":"'Org structure'!A13","v":"Vote 12 - [NAME OF VOTE 12]"},null,{"$f":"'C5C'!C297","v":0},{"$f":"'C5C'!D297","v":0},{"$f":"'C5C'!E297","v":0},{"$f":"'C5C'!F297","v":0},{"$f":"'C5C'!G297","v":0},0,{"$f":"'C5C'!I297","v":0},"",{"$f":"'C5C'!K297","v":0}]
[{"$f":"'Org structure'!A14","v":"Vote 13 - [NAME OF VOTE 13]"},null,{"$f":"'C5C'!C308","v":0},{"$f":"'C5C'!D308","v":0},{"$f":"'C5C'!E308","v":0},{"$f":"'C5C'!F308","v":0},{"$f":"'C5C'!G308","v":0},0,{"$f":"'C5C'!I308","v":0},"",{"$f":"'C5C'!K308","v":0}]
[{"$f":"'Org structure'!A15","v":"Vote 14 - [NAME OF VOTE 14]"},null,{"$f":"'C5C'!C319","v":0},{"$f":"'C5C'!D319","v":0},{"$f":"'C5C'!E319","v":0},{"$f":"'C5C'!F319","v":0},{"$f":"'C5C'!G319","v":0},0,{"$f":"'C5C'!I319","v":0},"",{"$f":"'C5C'!K319","v":0}]
[{"$f":"'Org structure'!A16","v":"Vote 15 - [NAME OF VOTE 15]"},null,{"$f":"'C5C'!C330","v":0},{"$f":"'C5C'!D330","v":0},{"$f":"'C5C'!E330","v":0},{"$f":"'C5C'!F330","v":0},{"$f":"'C5C'!G330","v":0},0,{"$f":"'C5C'!I330","v":0},"",{"$f":"'C5C'!K330","v":0}]
["Total Capital single-year expenditure",4,{"$f":"SUM(C24:C38)","v":15463513.360000003},65626000,54166006,1106699.23,29194107.400000002,49652172.166666672,-20458064.766666673,-0.41202758860167099,{"$f":"SUM(K24:K38)","v":54166006}]
["Total Capital Expenditure",null,{"$f":"C39+C21","v":547789828.08999991},768760054,802543953.45000005,66307801.809999987,513405543.31999993,735665290.6624999,-222259747.34250006,{"$f":"IF(I40=0,\"\",I40/H40)","v":-0.30212074725225257},{"$f":"K39+K21","v":802543953.45000005}]
[]
["Capital Expenditure - Functional Classification"]
["Governance and administration",null,{"$f":"SUM(C44:C46)","v":18773165.889999997},51000000,58773054,982424.98999999987,23664940.940000001,53875299.5,{"$f":"G43-H43","v":-30210358.559999999},{"$f":"IF(I43=0,\"\",I43/H43)","v":-0.56074599752341048},{"$f":"SUM(K44:K46)","v":58773054}]
["Executive and council",null,749658.04,1000000,7700000,154922.1,3133548.93,{"$f":"E44/12*11","v":7058333.333333333},-3924784.4033333329,{"$f":"IF(I44=0,\"\",I44/H44)","v":-0.55604973837072014},{"$f":"E44","v":7700000}]
["Finance and administration",null,18023507.849999998,50000000,51073054,827502.8899999999,20531392.010000002,{"$f":"E45/12*11","v":46816966.166666664},-26285574.156666663,-0.56145402636922248,{"$f":"E45","v":51073054}]
["Internal audit",null,0,0,0,0,0,0,0,""]
["Community and public safety",null,{"$f":"SUM(C48:C52)","v":57141397.170000002},169251913.99999994,190566517.53,13609871.93,93833603.189999998,174685974.40249997,-80852371.212499976,-0.46284409202884969,{"$f":"SUM(K48:K52)","v":190566517.53}]
["Community and social services",null,43937014.619999997,20307499.049999952,35901774,5730080.9100000001,29254509.039999999,{"$f":"E48/12*11","v":32909959.5},-3655450.4600000009,-0.11107429226705676,{"$f":"E48","v":35901774}]
["Sport and recreation",null,921500,0,8400000,0,2690675.75,7700000,-5009324.25,-0.65056159090909094,8400000]
["Public safety",null,147639.89000000001,4199000,972000,40000,40000,891000,-851000,-0.95510662177328842,972000]
["Housing",null,12135242.66,144745414.94999999,145292743.53,7839791.0200000005,61848418.399999991,133185014.90249999,-71336596.502499998,-0.53562029147740819,145292743.53]
["Health",null,0,0,0,0,0,0,0,""]
["Economic and environmental services",null,{"$f":"SUM(C54:C56)","v":277382246.46999997},107006000,192359032.92000002,27428104.269999996,211452936.66000003,176329113.50999999,35123823.150000036,0.1991946902631487,{"$f":"SUM(K54:K56)","v":192359032.92000002}]
["Planning and development",null,118611552.67999999,38606000,117803032.92,6210353.9799999995,88305835.940000013,{"$f":"E54/12*11","v":107986113.51000001},-19680277.569999993,-0.18224822553853195,{"$f":"E54","v":117803032.92}]
["Road transport",null,158748517.78999999,68400000,74556000,21217750.289999995,123147100.72,68343000,54804100.719999999,0.8018977908490994,74556000]
["Environmental protection",null,22176,0,0,0,0,0,0,"",0]
["Trading services",null,{"$f":"SUM(C58:C61)","v":191140453.74999994},438702140,357031190,24287400.620000001,183340496.68999997,327278590.83333331,-143938094.14333335,-0.43980296351445075,{"$f":"SUM(K58:K61)","v":357031190}]
["Energy sources",null,64942417.73999995,179000000,145974950,16508440.449999999,56841514.109999999,{"$f":"E58/12*11","v":133810370.83333333},-76968856.723333329,-0.57520845539843402,{"$f":"E58","v":145974950}]
["Water management",null,67841532.680000007,133924500,113879600,2342249.6700000004,56921091.719999991,104389633.33333333,-47468541.613333337,-0.45472467042544779,113879600]
["Waste water management",null,48191731.919999994,120777640,72176640,1062416.97,55369593.57,66161920,-10792326.43,-0.16311990991192515,72176640]
["Waste management",null,10164771.41,5000000,25000000,4374293.53,14208297.290000003,22916666.666666664,-8708369.3766666614,-0.3800015727999998,25000000]
["Other",null,3352564.8100000005,2800000,3814159,0,1113565.8399999999,3496312.4166666665,-2382746.5766666667,-0.68150276425764678,3814159]
["Total Capital Expenditure - Functional Classification",3,{"$f":"C43+C47+C53+C57+C62","v":547789828.08999991},{"$f":"D43+D47+D53+D57+D62","v":768760054},802543953.45000005,66307801.810000002,513405543.31999999,735665290.6624999,-222259747.34249994,-0.30212074725225241,{"$f":"K43+K47+K53+K57+K62","v":802543953.45000005}]
[]
["Funded by:"]
["National Government",null,251839997.30999997,312534640,412215016.94999999,24566442.59,251510834.81,{"$f":"E66/12*11","v":377863765.53750002},{"$f":"G66-H66","v":-126352930.72750002},{"$f":"IF(I66=0,\"\",I66/H66)","v":-0.33438752865802496},{"$f":"E66","v":412215016.94999999}]
["Provincial Government",null,111489785.61999999,136165414.94999999,123941186.5,6548008.3200000003,88128358.280000001,113612754.29166667,-25484396.01166667,-0.22430928790127846,123941186.5]
["District Municipality",null,null,null,null,null,null,null,0,""]
["Transfers and subsidies - capital (monetary allocations) (Nat / Prov Departm Agencies, Households, Non-profit Institutions, Private Enterprises, Public Corporatons, Higher Educ Institutions)",null,null,null,null,null,null,null,0,""]
["Transfers recognised - capital",null,{"$f":"SUM(C66:C69)","v":363329782.92999995},448700054.94999999,536156203.44999999,31114450.91,339639193.09000003,491476519.82916671,-151837326.73916668,-0.30894116120123932,{"$f":"SUM(K66:K69)","v":536156203.44999999}]
[]
["Borrowing",6,null,200000000,116274950,13498379.129999999,26830247.530000001,{"$f":"E72/12*11","v":106585370.83333333},-79755123.303333327,-0.74827457726863622,{"$f":"E72","v":116274950}]
["Internally generated funds",null,184460045.16,120059999.04999995,150112799.99999994,21694971.77,146936102.70000005,137603399.99999994,9332702.7000001073,6.7823198409342436E-2,150112799.99999994]
["Total Capital Funding",null,{"$f":"+C70+C72+C73","v":547789828.08999991},768760054,802543953.45000005,66307801.810000002,513405543.32000005,735665290.6624999,-222259747.34249985,-0.3021207472522523,{"$f":"+K70+K72+K73","v":802543953.45000005}]
[{"$f":"head27a","v":"References"}]
["1. Municipalities may choose to appropriate for capital expenditure for three years or for one year (if one year appropriation projected expenditure required for yr2 and yr3)."]
["2. Include capital component of PPP unitary payment"]
["3. Capital expenditure by functional classification must reconcile to the total of multi-year and single year appropriations"]
["4. Include expenditure on investment property, intangible and biological assets"]
[]
["6. Include finance leases and PPP capital funding component of unitary payment - total borrowing/repayments to reconcile to changes in Table SA17"]
["7. Total Capital Funding must balance with Total Capital Expenditure"]
[]
[]
[]
["check balance",null,{"$f":"C40-C74","v":0},{"$f":"D40-D74","v":0},0,0,0,0,null,null,0]

{"sheet":"C5C","index":13,"n_rows":345,"n_cols":23,"rows_kept":345,"cut":false,"hidden":false,"merged":[[1,3,1,10],[1,11,1,22],[0,0,0,10]]}
[{"$f":"muni& \" - \"&S71D& \" - \"&\"A\"& \" - \"&date","v":"KZN225 Msunduzi - Table C5 Consolidated Monthly Budget Statement - Capital Expenditure (municipal vote, functional classification and funding  - A - M11 May"}]
[{"$f":"Vdesc","v":"Vote Description"},{"$f":"head27","v":"Ref"},{"$f":"Head1","v":"2022/23"},{"$f":"Head2","v":"Budget Year 2023/24"},null,null,null,null,null,null,null,{"$f":"Head4","v":{"$error":"#NAME?"}}]
["R thousand",null,{"$f":"Head5","v":"Audited Outcome"},{"$f":"Head6","v":"Original Budget"},{"$f":"Head7","v":"Adjusted Budget"},{"$f":"Head38","v":"Monthly actual"},{"$f":"Head39","v":"YearTD actual"},"YearTD budget",{"$f":"Head41","v":"YTD variance"},{"$f":"Head41","v":"YTD variance"},{"$f":"Head8","v":"Full Year Forecast"},{"$f":"Head12","v":"Forecast 2010/11"},{"$f":"Head13","v":"Forecast 2011/12"},{"$f":"Head14","v":"Forecast 2012/13"},{"$f":"Head15","v":"Forecast 2013/14"},{"$f":"Head16","v":"Forecast 2014/15"},{"$f":"Head17","v":"Forecast 2015/16"},{"$f":"Head18","v":"Forecast 2016/17"},{"$f":"Head19","v":"Forecast 2017/18"},{"$f":"Head20","v":"Forecast 2018/19"},{"$f":"Head21","v":"Forecast 2019/20"},{"$f":"Head22","v":"Forecast 2020/21"},{"$f":"Head23","v":"Forecast 2021/22"}]
[null,null,null,null,null,null,null,null,null,"%"]
["Capital expenditure - Municipal Vote"]
["Expenditure of multi-year capital appropriation",1]
[{"$f":"'Org structure'!A2","v":"Vote 1 - City Manager"},null,{"$f":"SUM(C8:C17)","v":27000},{"$f":"SUM(D8:D17)","v":0},0,0,0,0,{"$f":"G7-H7","v":0},{"$f":"IF(I7=0,\"\",I7/H7)","v":""},0]
[{"$f":"'Org structure'!E3","v":"1.1 - Internal Audit and Compliance"},null,0,null,null,null,null,null,0,""]
[{"$f":"'Org structure'!E4","v":"1.2 - Office of the City Manager"},null,27000,null,null,null,null,null,0,""]
[{"$f":"'Org structure'!E5","v":"1.3 - Political Support"},null,0,null,null,null,null,null,0,""]
[{"$f":"'Org structure'!E6","v":"1.4 - Strategic Planning"},null,0,null,null,null,null,null,0,""]
[{"$f":"'Org structure'!E7","v":0},null,null,null,null,null,null,null,0,""]
[{"$f":"'Org structure'!E8","v":0},null,null,null,null,null,null,null,0,""]
[{"$f":"'Org structure'!E9","v":0},null,null,null,null,null,null,null,0,""]
[{"$f":"'Org structure'!E10","v":0},null,null,null,null,null,null,null,0,""]
[{"$f":"'Org structure'!E11","v":0},null,null,null,null,null,null,null,0,""]
[{"$f":"'Org structure'!E12","v":0},null,null,null,null,null,null,null,0,""]
[{"$f":"'Org structure'!A3","v":"Vote 2 - City Finance"},null,{"$f":"SUM(C19:C28)","v":9153029.5299999993},{"$f":"SUM(D19:D28)","v":30000000},30000000,0,5771250,27500000,-21728750,-0.79013636363636364,30000000]
[{"$f":"'Org structure'!E14","v":"2.1 - Asset Management"},null,0,0,null,null,null,{"$f":"E19/12*11","v":0},0,""]
[{"$f":"'Org structure'!E15","v":"2.2 - Budget and Treasury Management"},null,7990335.54,30000000,30000000,null,5771250,{"$f":"E20/12*11","v":27500000},-21728750,-0.79013636363636364,{"$f":"E20","v":30000000}]
[{"$f":"'Org structure'!E16","v":"2.3 - Expenditure Management"},null,0,0,null,null,null,null,0,""]
[{"$f":"'Org structure'!E17","v":"2.4 - Revenue Management"},null,1071543,0,null,null,null,null,0,""]
[{"$f":"'Org structure'!E18","v":"2.5 - Supply Chain Management"},null,91150.99,0,null,null,null,null,0,""]
[{"$f":"'Org structure'!E19","v":0},null,null,null,null,null,null,null,0,""]
[{"$f":"'Org structure'!E20","v":0},null,null,null,null,null,null,null,0,""]
[{"$f":"'Org structure'!E21","v":0},null,null,null,null,null,null,null,0,""]
[{"$f":"'Org structure'!E22","v":0},null,null,null,null,null,null,null,0,""]
[{"$f":"'Org structure'!E23","v":0},null,null,null,null,null,null,null,0,""]
[{"$f":"'Org structure'!A4","v":"Vote 3 - Corporate Services"},null,{"$f":"SUM(C30:C39)","v":937669.79},10000000,3318000,275993.05,1580186.73,3041500,-1461313.27,-0.48045808647049154,3318000]
[{"$f":"'Org structure'!E25","v":"3.1 - Human Resources Management"},null,48708,0,0,null,null,null,0,""]
[{"$f":"'Org structure'!E26","v":"3.2 - Information Technology"},null,338683.39,10000000,3000000,275993.05,1580186.73,{"$f":"E31/12*11","v":2750000},-1169813.27,-0.42538664363636364,{"$f":"E31","v":3000000}]
[{"$f":"'Org structure'!E27","v":"3.3 - Legal Services"},null,0,0,0,null,null,null,0,""]
[{"$f":"'Org structure'!E28","v":"3.4 - Secretariat and Auxiliary Services"},null,550278.40000000002,0,318000,null,null,{"$f":"E33/12*11","v":291500},-291500,-1,{"$f":"E33","v":318000}]
[{"$f":"'Org structure'!E29","v":"3.5 - General Manager: Corporate Service"},null,0,0,0,null,null,null,0,""]
[{"$f":"'Org structure'!E30","v":0},null,null,null,null,null,null,null,0,""]
[{"$f":"'Org structure'!E31","v":0},null,null,null,null,null,null,null,0,""]
[{"$f":"'Org structure'!E32","v":0},null,null,null,null,null,null,null,0,""]
[{"$f":"'Org structure'!E33","v":0},null,null,null,null,null,null,null,0,""]
[{"$f":"'Org structure'!E34","v":0},null,null,null,null,null,null,null,0,""]
[{"$f":"'Org structure'!A5","v":"Vote 4 - Community Services and Social Equity"},null,{"$f":"SUM(C41:C50)","v":48934490.920000002},24886499.049999952,68123568,10479741.449999999,46548305.859999999,62446604,-15898298.140000001,-0.25459027587793248,68123568]
[{"$f":"'Org structure'!E36","v":"4.1 - Area Based Management "},null,1117272.3,0,0,0,25704,{"$f":"E41/12*11","v":0},25704,{"$error":"#DIV/0!"},{"$f":"E41","v":0}]
[{"$f":"'Org structure'!E37","v":"4.2 - Public Safety, Emergency Services and Enforcement"},null,31440.240000000002,0,665000,403200,846594,609583.33333333326,237010.66666666674,0.38880765550239255,665000]
[{"$f":"'Org structure'!E38","v":"4.3 - Recreation and Facilities"},null,43245466.43,19886499.049999952,42458568,5702247.9199999999,31467710.57,38920354,-7452643.4299999997,-0.19148447185243997,42458568]
[{"$f":"'Org structure'!E39","v":"4.4 - Waste Management"},null,4540311.95,5000000,25000000,4374293.53,14208297.290000003,22916666.666666664,-8708369.3766666614,-0.3800015727999998,25000000]
[{"$f":"'Org structure'!E40","v":0},null,null,null,null,null,null,null,0,""]
[{"$f":"'Org structure'!E41","v":0},null,null,null,null,null,null,null,0,""]
[{"$f":"'Org structure'!E42","v":0},null,null,null,null,null,null,null,0,""]
[{"$f":"'Org structure'!E43","v":0},null,null,null,null,null,null,null,0,""]
[{"$f":"'Org structure'!E44","v":0},null,null,null,null,null,null,null,0,""]
[{"$f":"'Org structure'!E45","v":0},null,null,null,null,null,null,null,0,""]
[{"$f":"'Org structure'!A6","v":"Vote 5 - Infrastructure Services"},null,{"$f":"SUM(C52:C61)","v":268923267.12999994},{"$f":"SUM(D52:D61)","v":318102140},237994494,24219216.929999996,222521204.44999999,218161619.5,4359584.9499999881,1.9983281018868621E-2,237994494]
[{"$f":"'Org structure'!E47","v":"5.1 - Project Management Office"},null,0,0,138254,0,120220.32,{"$f":"E52/12*11","v":126732.83333333333},-6512.5133333333215,-5.138773561705258E-2,{"$f":"E52","v":138254}]
[{"$f":"'Org structure'!E48","v":"5.2 - Roads and Transportation"},null,153682616.33999991,63400000,68200000,20814550.289999995,120121433.09999999,62516666.666666664,57604766.43333333,0.92143054812050118,68200000]
[{"$f":"'Org structure'!E49","v":"5.3 - Water and Sanitation"},null,115240650.79000001,254702140,169656240,3404666.64,102279551.02999999,155518220,-53238668.970000014,-0.34233075050627515,169656240]
[{"$f":"'Org structure'!E50","v":"5.4 - General Manager: Infrastructure "},null,0,0,null,0,0,null,0,"",0]
[{"$f":"'Org structure'!E51","v":0},null,null,null,null,null,null,null,0,""]
[{"$f":"'Org structure'!E52","v":0},null,null,null,null,null,null,null,0,""]
[{"$f":"'Org structure'!E53","v":0},null,null,null,null,null,null,null,0,""]
[{"$f":"'Org structure'!E54","v":0},null,null,null,null,null,null,null,0,""]
[{"$f":"'Org structure'!E55","v":0},null,null,null,null,null,null,null,0,""]
[{"$f":"'Org structure'!E56","v":0},null,null,null,null,null,null,null,0,""]
[{"$f":"'Org structure'!A7","v":"Vote 6 - Sustainable Development and City Enterprises"},null,{"$f":"SUM(C63:C72)","v":133279407.06},{"$f":"SUM(D63:D72)","v":144745414.94999999},266966935.44999999,13917362.5,151148626.56999999,244719690.82916668,-93571064.259166688,-0.38236017682976947,266966935.44999999]
[{"$f":"'Org structure'!E58","v":"6.1 - City Entities"},null,3094804.23,0,4671159,40000,1187344.73,{"$f":"E63/12*11","v":4281895.75},-3094551.02,-0.7227058295382367,{"$f":"E63","v":4671159}]
[{"$f":"'Org structure'!E59","v":"6.2 - Development Services"},null,31344443.969999999,0,31444183.780000001,5462842.6799999997,10265843.32,28823835.131666668,-18557991.811666667,-0.64384186652796738,31444183.780000001]
[{"$f":"'Org structure'!E60","v":"6.3 - Human Settlement Development"},null,11746687.439999999,144745414.94999999,144892743.53,7831891.0200000005,61820328.399999991,132818348.23583335,-70998019.835833356,-0.53454978757730587,144892743.53]
[{"$f":"'Org structure'!E61","v":"6.4 - Town Planning"},null,87093471.420000002,0,85958849.140000001,582628.80000000005,77875110.120000005,78795611.711666673,-920501.59166666865,-1.1682142846165339E-2,85958849.140000001]
[{"$f":"'Org structure'!E62","v":"6.5 - General Manager: Sustainable Development and City Enterprises"},null,0,0,null,0,0,0,0,"",0]
[{"$f":"'Org structure'!E63","v":0},null,null,null,null,null,null,null,0,""]
[{"$f":"'Org structure'!E64","v":0},null,null,null,null,null,null,null,0,""]
[{"$f":"'Org structure'!E65","v":0},null,null,null,null,null,null,null,0,""]
[{"$f":"'Org structure'!E66","v":0},null,null,null,null,null,null,null,{"$f":"G71-H71","v":0},{"$f":"IF(I71=0,\"\",I71/H71)","v":""}]
[{"$f":"'Org structure'!E67","v":0},null,null,null,null,null,null,null,0,""]
[{"$f":"'Org structure'!A8","v":"Vote 7 - Electricity"},null,{"$f":"SUM(C74:C83)","v":71071450.300000012},175400000,141974950,16308788.649999999,56641862.310000002,130143704.16666667,-73501841.856666669,-0.56477447239812373,141974950]
[{"$f":"'Org structure'!E69","v":"7.1 Electricity planning"},null,65880810.790000014,155400000,134974950,16112614.589999998,48541030.800000004,{"$f":"E74/12*11","v":123727037.5},-75186006.699999988,-0.60767644824600275,{"$f":"E74","v":134974950}]
[{"$f":"'Org structure'!E70","v":"7.2 Methods and Standards"},null,0,0,0,0,0,0,0,"",0]
[{"$f":"'Org structure'!E71","v":"7.3 Operations and Maintenance"},null,0,0,0,0,0,0,0,"",0]
[{"$f":"'Org structure'!E72","v":"7.4 Revenue Management"},null,5190639.5100000007,20000000,7000000,196174.06,8100831.5099999998,6416666.666666667,1684164.8433333328,0.26246724831168822,7000000]
[{"$f":"'Org structure'!E73","v":"7.5 General Manager Electricity"},null,0,0,0,0,0,0,0,"",0]
[{"$f":"'Org structure'!E74","v":0},null,null,null,null,null,null,null,0,""]
[{"$f":"'Org structure'!E75","v":0},null,null,null,null,null,null,null,0,""]
[{"$f":"'Org structure'!E76","v":0},null,null,null,null,null,null,null,0,""]
[{"$f":"'Org structure'!E77","v":0},null,null,null,null,null,null,null,0,""]
[{"$f":"'Org structure'!E78","v":0},null,null,null,null,null,null,null,0,""]
[{"$f":"'Org structure'!A9","v":"Vote 8 - [NAME OF VOTE 8]"},null,{"$f":"SUM(C85:C94)","v":0},{"$f":"SUM(D85:D94)","v":0},0,0,0,0,0,"",0]
[{"$f":"'Org structure'!E80","v":"8.1 - [Name of sub-vote]"},null,null,null,null,null,null,null,0,""]
[{"$f":"'Org structure'!E81","v":0},null,null,null,null,null,null,null,0,""]
[{"$f":"'Org structure'!E82","v":0},null,null,null,null,null,null,null,0,""]
[{"$f":"'Org structure'!E83","v":0},null,null,null,null,null,null,null,0,""]
[{"$f":"'Org structure'!E84","v":0},null,null,null,null,null,null,null,0,""]
[{"$f":"'Org structure'!E85","v":0},null,null,null,null,null,null,null,0,""]
[{"$f":"'Org structure'!E86","v":0},null,null,null,null,null,null,null,0,""]
[{"$f":"'Org structure'!E87","v":0},null,null,null,null,null,null,null,0,""]
[{"$f":"'Org structure'!E88","v":0},null,null,null,null,null,null,null,0,""]
[{"$f":"'Org structure'!E89","v":0},null,null,null,null,null,null,null,0,""]
[{"$f":"'Org structure'!A10","v":"Vote 9 - [NAME OF VOTE 9]"},null,{"$f":"SUM(C96:C105)","v":0},{"$f":"SUM(D96:D105)","v":0},0,0,0,0,0,"",0]
[{"$f":"'Org structure'!E91","v":"9.1 - [Name of sub-vote]"},null,null,null,null,null,null,null,0,""]
[{"$f":"'Org structure'!E92","v":0},null,null,null,null,null,null,null,0,""]
[{"$f":"'Org structure'!E93","v":0},null,null,null,null,null,null,null,0,""]
[{"$f":"'Org structure'!E94","v":0},null,null,null,null,null,null,null,0,""]
[{"$f":"'Org structure'!E95","v":0},null,null,null,null,null,null,null,0,""]
[{"$f":"'Org structure'!E96","v":0},null,null,null,null,null,null,null,0,""]
[{"$f":"'Org structure'!E97","v":0},null,null,null,null,null,null,null,0,""]
[{"$f":"'Org structure'!E98","v":0},null,null,null,null,null,null,null,0,""]
[{"$f":"'Org structure'!E99","v":0},null,null,null,null,null,null,null,0,""]
[{"$f":"'Org structure'!E100","v":0},null,null,null,null,null,null,null,0,""]
[{"$f":"'Org structure'!A11","v":"Vote 10 - [NAME OF VOTE 10]"},null,{"$f":"SUM(C107:C116)","v":0},{"$f":"SUM(D107:D116)","v":0},0,0,0,0,0,"",0]
[{"$f":"'Org structure'!E102","v":"10.1 - [Name of sub-vote]"},null,null,null,null,null,null,null,0,""]
[{"$f":"'Org structure'!E103","v":0},null,null,null,null,null,null,null,0,""]
[{"$f":"'Org structure'!E104","v":0},null,null,null,null,null,null,null,0,""]
[{"$f":"'Org structure'!E105","v":0},null,null,null,null,null,null,null,0,""]
[{"$f":"'Org structure'!E106","v":0},null,null,null,null,null,null,null,0,""]
[{"$f":"'Org structure'!E107","v":0},null,null,null,null,null,null,null,0,""]
[{"$f":"'Org structure'!E108","v":0},null,null,null,null,null,null,null,0,""]
[{"$f":"'Org structure'!E109","v":0},null,null,null,null,null,null,null,0,""]
[{"$f":"'Org structure'!E110","v":0},null,null,null,null,null,null,null,0,""]
[{"$f":"'Org structure'!E111","v":0},null,null,null,null,null,null,null,0,""]
[{"$f":"'Org structure'!A12","v":"Vote 11 - [NAME OF VOTE 11]"},null,{"$f":"SUM(C118:C127)","v":0},{"$f":"SUM(D118:D127)","v":0},0,0,0,0,0,"",0]
[{"$f":"'Org structure'!E113","v":"11.1 - [Name of sub-vote]"},null,null,null,null,null,null,null,0,""]
[{"$f":"'Org structure'!E114","v":0},null,null,null,null,null,null,null,0,""]
[{"$f":"'Org structure'!E115","v":0},null,null,null,null,null,null,null,0,""]
[{"$f":"'Org structure'!E116","v":0},null,null,null,null,null,null,null,0,""]
[{"$f":"'Org structure'!E117","v":0},null,null,null,null,null,null,null,0,""]
[{"$f":"'Org structure'!E118","v":0},null,null,null,null,null,null,null,0,""]
[{"$f":"'Org structure'!E119","v":0},null,null,null,null,null,null,null,0,""]
[{"$f":"'Org structure'!E120","v":0},null,null,null,null,null,null,null,0,""]
[{"$f":"'Org structure'!E121","v":0},null,null,null,null,null,null,null,0,""]
[{"$f":"'Org structure'!E122","v":0},null,null,null,null,null,null,null,0,""]
[{"$f":"'Org structure'!A13","v":"Vote 12 - [NAME OF VOTE 12]"},null,{"$f":"SUM(C129:C138)","v":0},{"$f":"SUM(D129:D138)","v":0},0,0,0,0,0,"",0]
[{"$f":"'Org structure'!E124","v":"12.1 - [Name of sub-vote]"},null,null,null,null,null,null,null,0,""]
[{"$f":"'Org structure'!E125","v":0},null,null,null,null,null,null,null,0,""]
[{"$f":"'Org structure'!E126","v":0},null,null,null,null,null,null,null,0,""]
[{"$f":"'Org structure'!E127","v":0},null,null,null,null,null,null,null,0,""]
[{"$f":"'Org structure'!E128","v":0},null,null,null,null,null,null,null,0,""]
[{"$f":"'Org structure'!E129","v":0},null,null,null,null,null,null,null,0,""]
[{"$f":"'Org structure'!E130","v":0},null,null,null,null,null,null,null,{"$f":"G135-H135","v":0},{"$f":"IF(I135=0,\"\",I135/H135)","v":""}]
[{"$f":"'Org structure'!E131","v":0},null,null,null,null,null,null,null,0,""]
[{"$f":"'Org structure'!E132","v":0},null,null,null,null,null,null,null,0,""]
[{"$f":"'Org structure'!E133","v":0},null,null,null,null,null,null,null,0,""]
[{"$f":"'Org structure'!A14","v":"Vote 13 - [NAME OF VOTE 13]"},null,{"$f":"SUM(C140:C149)","v":0},{"$f":"SUM(D140:D149)","v":0},0,0,0,0,0,"",0]
[{"$f":"'Org structure'!E135","v":"13.1 - [Name of sub-vote]"},null,null,null,null,null,null,null,0,""]
[{"$f":"'Org structure'!E136","v":0},null,null,null,null,null,null,null,0,""]
[{"$f":"'Org structure'!E137","v":0},null,null,null,null,null,null,null,0,""]
[{"$f":"'Org structure'!E138","v":0},null,null,null,null,null,null,null,0,""]
[{"$f":"'Org structure'!E139","v":0},null,null,null,null,null,null,null,0,""]
[{"$f":"'Org structure'!E140","v":0},null,null,null,null,null,null,null,0,""]
[{"$f":"'Org structure'!E141","v":0},null,null,null,null,null,null,null,0,""]
[{"$f":"'Org structure'!E142","v":0},null,null,null,null,null,null,null,0,""]
[{"$f":"'Org structure'!E143","v":0},null,null,null,null,null,null,null,0,""]
[{"$f":"'Org structure'!E144","v":0},null,null,null,null,null,null,null,0,""]
[{"$f":"'Org structure'!A15","v":"Vote 14 - [NAME OF VOTE 14]"},null,{"$f":"SUM(C151:C160)","v":0},{"$f":"SUM(D151:D160)","v":0},0,0,0,0,0,"",0]
[{"$f":"'Org structure'!E146","v":"14.1 - [Name of sub-vote]"},null,null,null,null,null,null,null,0,""]
[{"$f":"'Org structure'!E147","v":0},null,null,null,null,null,null,null,0,""]
[{"$f":"'Org structure'!E148","v":0},null,null,null,null,null,null,null,0,""]
[{"$f":"'Org structure'!E149","v":0},null,null,null,null,null,null,null,0,""]
[{"$f":"'Org structure'!E150","v":0},null,null,null,null,null,null,null,0,""]
[{"$f":"'Org structure'!E151","v":0},null,null,null,null,null,null,null,0,""]
[{"$f":"'Org structure'!E152","v":0},null,null,null,null,null,null,null,0,""]
[{"$f":"'Org structure'!E153","v":0},null,null,null,null,null,null,null,0,""]
[{"$f":"'Org structure'!E154","v":0},null,null,null,null,null,null,null,0,""]
[{"$f":"'Org structure'!E155","v":0},null,null,null,null,null,null,null,0,""]
[{"$f":"'Org structure'!A16","v":"Vote 15 - [NAME OF VOTE 15]"},null,{"$f":"SUM(C162:C171)","v":0},{"$f":"SUM(D162:D171)","v":0},0,0,0,0,0,"",0]
[{"$f":"'Org structure'!E157","v":"15.1 - [Name of sub-vote]"},null,null,null,null,null,null,null,0,""]
[{"$f":"'Org structure'!E158","v":0},null,null,null,null,null,null,null,0,""]
[{"$f":"'Org structure'!E159","v":0},null,null,null,null,null,null,null,0,""]
[{"$f":"'Org structure'!E160","v":0},null,null,null,null,null,null,null,0,""]
[{"$f":"'Org structure'!E161","v":0},null,null,null,null,null,null,null,0,""]
[{"$f":"'Org structure'!E162","v":0},null,null,null,null,null,null,null,0,""]
[{"$f":"'Org structure'!E163","v":0},null,null,null,null,null,null,null,0,""]
[{"$f":"'Org structure'!E164","v":0},null,null,null,null,null,null,null,0,""]
[{"$f":"'Org structure'!E165","v":0},null,null,null,null,null,null,null,0,""]
[{"$f":"'Org structure'!E166","v":0},null,null,null,null,null,null,null,0,"",null,{"$f":"SUM(L79:L82)","v":0},0,0,0,0,0,0,0,0,0,0,0]
["Total multi-year capital expenditure",null,{"$f":"C7+C18+C29+C40+C51+C62+C73+C84+C95+C106+C117+C128+C139+C150+C161","v":532326314.72999996},{"$f":"D7+D18+D29+D40+D51+D62+D73+D84+D95+D106+D117+D128+D139+D150+D161","v":703134054},748377947.45000005,65201102.579999991,484211435.91999996,686013118.49583328,-201801682.57583332,-0.29416592355887877,748377947.45000005]
[null,null,null,null,null,null,null,null,0,""]
["Capital expenditure - Municipal Vote"]
["Expenditue of single-year capital appropriation",1,null,null,null,null,null,null,0,""]
[{"$f":"'Org structure'!A2","v":"Vote 1 - City Manager"},null,{"$f":"SUM(C177:C186)","v":943953.22},5000000,7700000,154922.1,3133548.93,7058333.333333334,-3924784.4033333338,-0.55604973837072025,7700000]
[{"$f":"'Org structure'!E3","v":"1.1 - Internal Audit and Compliance"},null,0,0,0,null,null,{"$f":"E177/12*11","v":0},0,"",{"$f":"E177","v":0}]
[{"$f":"'Org structure'!E4","v":"1.2 - Office of the City Manager"},null,194295.18,1000000,5000000,154922.1,1237093.9300000002,4583333.333333334,-3346239.4033333338,-0.73008859709090912,5000000]
[{"$f":"'Org structure'!E5","v":"1.3 - Political Support"},null,749658.04,0,2700000,0,1896455,2475000,-578545,-0.23375555555555555,2700000]
[{"$f":"'Org structure'!E6","v":"1.4 - Strategic Planning"},null,0,4000000,0,null,null,0,0,"",0]
[{"$f":"'Org structure'!E7","v":0},null,null,null,null,null,null,null,0,""]
[{"$f":"'Org structure'!E8","v":0},null,null,null,null,null,null,null,0,""]
[{"$f":"'Org structure'!E9","v":0},null,null,null,null,null,null,null,0,""]
[{"$f":"'Org structure'!E10","v":0},null,null,null,null,null,null,null,0,""]
[{"$f":"'Org structure'!E11","v":0},null,null,null,null,null,null,null,0,""]
[{"$f":"'Org structure'!E12","v":0},null,null,null,null,null,null,null,0,""]
[{"$f":"'Org structure'!A3","v":"Vote 2 - City Finance"},null,{"$f":"SUM(C188:C197)","v":3084194.2200000007},{"$f":"SUM(D188:D197)","v":0},{"$f":"SUM(E188:E197)","v":0},2499,2499,0,2499,{"$error":"#DIV/0!"},0]
[{"$f":"'Org structure'!E14","v":"2.1 - Asset Management"},null,2497739.8200000003,null,null,null,null,null,0,""]
[{"$f":"'Org structure'!E15","v":"2.2 - Budget and Treasury Management"},null,0,null,null,null,null,null,0,""]
[{"$f":"'Org structure'!E16","v":"2.3 - Expenditure Management"},null,49674.91,null,null,null,null,null,0,""]
[{"$f":"'Org structure'!E17","v":"2.4 - Revenue Management"},null,0,null,null,null,null,null,0,""]
[{"$f":"'Org structure'!E18","v":"2.5 - Supply Chain Management"},null,536779.49,null,null,2499,2499,null,2499,{"$error":"#DIV/0!"}]
[{"$f":"'Org structure'!E19","v":0},null,null,null,null,null,null,null,0,""]
[{"$f":"'Org structure'!E20","v":0},null,null,null,null,null,null,null,0,""]
[{"$f":"'Org structure'!E21","v":0},null,null,null,null,null,null,null,0,""]
[{"$f":"'Org structure'!E22","v":0},null,null,null,null,null,null,null,0,""]
[{"$f":"'Org structure'!E23","v":0},null,null,null,null,null,null,null,0,""]
[{"$f":"'Org structure'!A4","v":"Vote 3 - Corporate Services"},null,{"$f":"SUM(C199:C208)","v":3796496.8200000003},10000000,17000000,549010.84,13057235.959999999,15583333.333333334,-2526097.3733333349,-0.16210250524064182,17000000]
[{"$f":"'Org structure'!E25","v":"3.1 - Human Resources Management"},null,0,0,null,null,null,null,0,""]
[{"$f":"'Org structure'!E26","v":"3.2 - Information Technology"},null,2630224.8200000003,10000000,17000000,549010.84,13057235.959999999,{"$f":"E200/12*11","v":15583333.333333334},{"$f":"G200-H200","v":-2526097.3733333349},{"$f":"IF(I200=0,\"\",I200/H200)","v":-0.16210250524064182},{"$f":"E200","v":17000000}]
[{"$f":"'Org structure'!E27","v":"3.3 - Legal Services"},null,0,0,null,null,null,null,0,""]
[{"$f":"'Org structure'!E28","v":"3.4 - Secretariat and Auxiliary Services"},null,1166272,0,null,null,null,null,0,""]
[{"$f":"'Org structure'!E29","v":"3.5 - General Manager: Corporate Service"},null,0,0,null,null,null,null,0,""]
[{"$f":"'Org structure'!E30","v":0},null,null,null,null,null,null,null,0,""]
[{"$f":"'Org structure'!E31","v":0},null,null,null,null,null,null,null,0,""]
[{"$f":"'Org structure'!E32","v":0},null,null,null,null,null,null,null,0,""]
[{"$f":"'Org structure'!E33","v":0},null,null,null,null,null,null,null,0,""]
[{"$f":"'Org structure'!E34","v":0},null,null,null,null,null,null,null,0,""]
[{"$f":"'Org structure'!A5","v":"Vote 4 - Community Services and Social Equity"},null,{"$f":"SUM(C210:C219)","v":4980126},4000000,4229800,27832.99,2597064.9500000002,3877316.6666666665,-1280251.7166666663,-0.33019013578978584,4229800]
[{"$f":"'Org structure'!E36","v":"4.1 - Area Based Management "},null,302598,null,0,null,null,null,0,""]
[{"$f":"'Org structure'!E37","v":"4.2 - Public Safety, Emergency Services and Enforcement"},null,440841.54,4000000,2663000,0,2179073.62,{"$f":"E211/12*11","v":2441083.333333333},-262009.71333333291,-0.10733337520909417,{"$f":"E211","v":2663000}]
[{"$f":"'Org structure'!E38","v":"4.3 - Recreation and Facilities"},null,0,null,1566800,27832.99,417991.32999999996,1436233.3333333335,-1018242.0033333335,-0.70896697611808668,1566800]
[{"$f":"'Org structure'!E39","v":"4.4 - Waste Management"},null,4236686.46,null,0,null,null,null,0,""]
[{"$f":"'Org structure'!E40","v":0},null,null,null,null,null,null,null,0,""]
[{"$f":"'Org structure'!E41","v":0},null,null,null,null,null,null,null,0,""]
[{"$f":"'Org structure'!E42","v":0},null,null,null,null,null,null,null,0,""]
[{"$f":"'Org structure'!E43","v":0},null,null,null,null,null,null,null,0,""]
[{"$f":"'Org structure'!E44","v":0},null,null,null,null,null,null,null,0,""]
[{"$f":"'Org structure'!E45","v":0},null,null,null,null,null,null,null,0,""]
[{"$f":"'Org structure'!A6","v":"Vote 5 - Infrastructure Services"},null,{"$f":"SUM(C221:C230)","v":792613.81},5000000,19850000,0,10011134.26,18195833.333333336,-8184699.073333336,-0.44981171916647594,19850000]
[{"$f":"'Org structure'!E47","v":"5.1 - Project Management Office"},null,0,0,150000,null,null,{"$f":"E221/12*11","v":137500},-137500,-1,{"$f":"E221","v":150000}]
[{"$f":"'Org structure'!E48","v":"5.2 - Roads and Transportation"},null,0,5000000,3300000,null,null,3025000,-3025000,-1,3300000]
[{"$f":"'Org structure'!E49","v":"5.3 - Water and Sanitation"},null,792613.81,0,16400000,0,10011134.26,15033333.333333334,-5022199.0733333342,-0.33407089179600891,16400000]
[{"$f":"'Org structure'!E50","v":"5.4 - General Manager: Infrastructure "},null,0,0,null,null,null,null,0,"",0]
[{"$f":"'Org structure'!E51","v":0},null,null,null,null,null,null,null,0,""]
[{"$f":"'Org structure'!E52","v":0},null,null,null,null,null,null,null,0,""]
[{"$f":"'Org structure'!E53","v":0},null,null,null,null,null,null,null,0,""]
[{"$f":"'Org structure'!E54","v":0},null,null,null,null,null,null,null,0,""]
[{"$f":"'Org structure'!E55","v":0},null,null,null,null,null,null,null,0,""]
[{"$f":"'Org structure'!E56","v":0},null,null,null,null,null,null,null,0,""]
[{"$f":"'Org structure'!A7","v":"Vote 6 - Sustainable Development and City Enterprises"},null,{"$f":"SUM(C232:C241)","v":1035306.98},38026000,1386206,172782.5,192972.5,1270688.8333333333,-1077716.3333333333,-0.84813551914689844,1386206]
[{"$f":"'Org structure'!E58","v":"6.1 - City Entities"},null,450938.47,3420000,586206,null,null,{"$f":"E232/12*11","v":537355.5},-537355.5,-1,{"$f":"E232","v":586206}]
[{"$f":"'Org structure'!E59","v":"6.2 - Development Services"},null,195813.29,34606000,100000,null,null,91666.666666666672,-91666.666666666672,-1,100000]
[{"$f":"'Org structure'!E60","v":"6.3 - Human Settlement Development"},null,388555.22,null,400000,7900,28090,366666.66666666669,-338576.66666666669,-0.92339090909090904,400000]
[{"$f":"'Org structure'!E61","v":"6.4 - Town Planning"},null,0,null,300000,164882.5,164882.5,275000,-110117.5,-0.40042727272727274,300000]
[{"$f":"'Org structure'!E62","v":"6.5 - General Manager: Sustainable Development and City Enterprises"},null,0,null,null,null,null,null,0,"",0]
[{"$f":"'Org structure'!E63","v":0},null,null,null,null,null,null,null,0,""]
[{"$f":"'Org structure'!E64","v":0},null,null,null,null,null,null,null,0,""]
[{"$f":"'Org structure'!E65","v":0},null,null,null,null,null,null,null,0,""]
[{"$f":"'Org structure'!E66","v":0},null,null,null,null,null,null,null,0,""]
[{"$f":"'Org structure'!E67","v":0},null,null,null,null,null,null,null,0,""]
[{"$f":"'Org structure'!A8","v":"Vote 7 - Electricity"},null,{"$f":"SUM(C243:C252)","v":830822.31},3600000,4000000,199651.8,199651.8,3666666.6666666665,-3467014.8666666667,-0.94554950909090918,4000000]
[{"$f":"'Org structure'!E69","v":"7.1 Electricity planning"},null,0,3600000,4000000,199651.8,199651.8,{"$f":"E243/12*11","v":3666666.6666666665},-3467014.8666666667,-0.94554950909090918,{"$f":"E243","v":4000000}]
[{"$f":"'Org structure'!E70","v":"7.2 Methods and Standards"},null,0,0,null,null,null,null,0,""]
[{"$f":"'Org structure'!E71","v":"7.3 Operations and Maintenance"},null,0,0,null,null,null,null,0,""]
[{"$f":"'Org structure'!E72","v":"7.4 Revenue Management"},null,0,0,null,null,null,null,0,""]
[{"$f":"'Org structure'!E73","v":"7.5 General Manager Electricity"},null,830822.31,0,null,null,null,null,0,""]
[{"$f":"'Org structure'!E74","v":0},null,null,null,null,null,null,null,0,""]
[{"$f":"'Org structure'!E75","v":0},null,null,null,null,null,null,null,0,""]
[{"$f":"'Org structure'!E76","v":0},null,null,null,null,null,null,null,0,""]
[{"$f":"'Org structure'!E77","v":0},null,null,null,null,null,null,null,0,""]
[{"$f":"'Org structure'!E78","v":0},null,null,null,null,null,null,null,0,""]
[{"$f":"'Org structure'!A9","v":"Vote 8 - [NAME OF VOTE 8]"},null,{"$f":"SUM(C254:C263)","v":0},0,0,0,0,0,0,"",0]
[{"$f":"'Org structure'!E80","v":"8.1 - [Name of sub-vote]"},null,null,null,null,null,null,null,0,""]
[{"$f":"'Org structure'!E81","v":0},null,null,null,null,null,null,null,0,""]
[{"$f":"'Org structure'!E82","v":0},null,null,null,null,null,null,null,0,""]
[{"$f":"'Org structure'!E83","v":0},null,null,null,null,null,null,null,0,""]
[{"$f":"'Org structure'!E84","v":0},null,null,null,null,null,null,null,0,""]
[{"$f":"'Org structure'!E85","v":0},null,null,null,null,null,null,null,0,""]
[{"$f":"'Org structure'!E86","v":0},null,null,null,null,null,null,null,0,""]
[{"$f":"'Org structure'!E87","v":0},null,null,null,null,null,null,null,0,""]
[{"$f":"'Org structure'!E88","v":0},null,null,null,null,null,null,null,0,""]
[{"$f":"'Org structure'!E89","v":0},null,null,null,null,null,null,null,0,""]
[{"$f":"'Org structure'!A10","v":"Vote 9 - [NAME OF VOTE 9]"},null,{"$f":"SUM(C265:C274)","v":0},0,0,0,0,0,{"$f":"G264-H264","v":0},{"$f":"IF(I264=0,\"\",I264/H264)","v":""},0]
[{"$f":"'Org structure'!E91","v":"9.1 - [Name of sub-vote]"},null,null,null,null,null,null,null,0,""]
[{"$f":"'Org structure'!E92","v":0},null,null,null,null,null,null,null,0,""]
[{"$f":"'Org structure'!E93","v":0},null,null,null,null,null,null,null,0,""]
[{"$f":"'Org structure'!E94","v":0},null,null,null,null,null,null,null,0,""]
[{"$f":"'Org structure'!E95","v":0},null,null,null,null,null,null,null,0,""]
[{"$f":"'Org structure'!E96","v":0},null,null,null,null,null,null,null,0,""]
[{"$f":"'Org structure'!E97","v":0},null,null,null,null,null,null,null,0,""]
[{"$f":"'Org structure'!E98","v":0},null,null,null,null,null,null,null,0,""]
[{"$f":"'Org structure'!E99","v":0},null,null,null,null,null,null,null,0,""]
[{"$f":"'Org structure'!E100","v":0},null,null,null,null,null,null,null,0,""]
[{"$f":"'Org structure'!A11","v":"Vote 10 - [NAME OF VOTE 10]"},null,{"$f":"SUM(C276:C285)","v":0},0,0,0,0,0,0,"",0]
[{"$f":"'Org structure'!E102","v":"10.1 - [Name of sub-vote]"},null,null,null,null,null,null,null,0,""]
[{"$f":"'Org structure'!E103","v":0},null,null,null,null,null,null,null,0,""]
[{"$f":"'Org structure'!E104","v":0},null,null,null,null,null,null,null,0,""]
[{"$f":"'Org structure'!E105","v":0},null,null,null,null,null,null,null,0,""]
[{"$f":"'Org structure'!E106","v":0},null,null,null,null,null,null,null,0,""]
[{"$f":"'Org structure'!E107","v":0},null,null,null,null,null,null,null,0,""]
[{"$f":"'Org structure'!E108","v":0},null,null,null,null,null,null,null,0,""]
[{"$f":"'Org structure'!E109","v":0},null,null,null,null,null,null,null,0,""]
[{"$f":"'Org structure'!E110","v":0},null,null,null,null,null,null,null,0,""]
[{"$f":"'Org structure'!E111","v":0},null,null,null,null,null,null,null,0,""]
[{"$f":"'Org structure'!A12","v":"Vote 11 - [NAME OF VOTE 11]"},null,{"$f":"SUM(C287:C296)","v":0},0,0,0,0,0,0,"",0]
[{"$f":"'Org structure'!E113","v":"11.1 - [Name of sub-vote]"},null,null,null,null,null,null,null,0,""]
[{"$f":"'Org structure'!E114","v":0},null,null,null,null,null,null,null,0,""]
[{"$f":"'Org structure'!E115","v":0},null,null,null,null,null,null,null,0,""]
[{"$f":"'Org structure'!E116","v":0},null,null,null,null,null,null,null,0,""]
[{"$f":"'Org structure'!E117","v":0},null,null,null,null,null,null,null,0,""]
[{"$f":"'Org structure'!E118","v":0},null,null,null,null,null,null,null,0,""]
[{"$f":"'Org structure'!E119","v":0},null,null,null,null,null,null,null,0,""]
[{"$f":"'Org structure'!E120","v":0},null,null,null,null,null,null,null,0,""]
[{"$f":"'Org structure'!E121","v":0},null,null,null,null,null,null,null,0,""]
[{"$f":"'Org structure'!E122","v":0},null,null,null,null,null,null,null,0,""]
[{"$f":"'Org structure'!A13","v":"Vote 12 - [NAME OF VOTE 12]"},null,{"$f":"SUM(C298:C307)","v":0},0,0,0,0,0,0,"",0]
[{"$f":"'Org structure'!E124","v":"12.1 - [Name of sub-vote]"},null,null,null,null,null,null,null,0,""]
[{"$f":"'Org structure'!E125","v":0},null,null,null,null,null,null,null,0,""]
[{"$f":"'Org structure'!E126","v":0},null,null,null,null,null,null,null,0,""]
[{"$f":"'Org structure'!E127","v":0},null,null,null,null,null,null,null,0,""]
[{"$f":"'Org structure'!E128","v":0},null,null,null,null,null,null,null,0,""]
[{"$f":"'Org structure'!E129","v":0},null,null,null,null,null,null,null,0,""]
[{"$f":"'Org structure'!E130","v":0},null,null,null,null,null,null,null,0,""]
[{"$f":"'Org structure'!E131","v":0},null,null,null,null,null,null,null,0,""]
[{"$f":"'Org structure'!E132","v":0},null,null,null,null,null,null,null,0,""]
[{"$f":"'Org structure'!E133","v":0},null,null,null,null,null,null,null,0,""]
[{"$f":"'Org structure'!A14","v":"Vote 13 - [NAME OF VOTE 13]"},null,{"$f":"SUM(C309:C318)","v":0},0,0,0,0,0,0,"",0]
[{"$f":"'Org structure'!E135","v":"13.1 - [Name of sub-vote]"},null,null,null,null,null,null,null,0,""]
[{"$f":"'Org structure'!E136","v":0},null,null,null,null,null,null,null,0,""]
[{"$f":"'Org structure'!E137","v":0},null,null,null,null,null,null,null,0,""]
[{"$f":"'Org structure'!E138","v":0},null,null,null,null,null,null,null,0,""]
[{"$f":"'Org structure'!E139","v":0},null,null,null,null,null,null,null,0,""]
[{"$f":"'Org structure'!E140","v":0},null,null,null,null,null,null,null,0,""]
[{"$f":"'Org structure'!E141","v":0},null,null,null,null,null,null,null,0,""]
[{"$f":"'Org structure'!E142","v":0},null,null,null,null,null,null,null,0,""]
[{"$f":"'Org structure'!E143","v":0},null,null,null,null,null,null,null,0,""]
[{"$f":"'Org structure'!E144","v":0},null,null,null,null,null,null,null,0,""]
[{"$f":"'Org structure'!A15","v":"Vote 14 - [NAME OF VOTE 14]"},null,{"$f":"SUM(C320:C329)","v":0},0,0,0,0,0,0,"",0]
[{"$f":"'Org structure'!E146","v":"14.1 - [Name of sub-vote]"},null,null,null,null,null,null,null,0,""]
[{"$f":"'Org structure'!E147","v":0},null,null,null,null,null,null,null,0,""]
[{"$f":"'Org structure'!E148","v":0},null,null,null,null,null,null,null,0,""]
[{"$f":"'Org structure'!E149","v":0},null,null,null,null,null,null,null,0,""]
[{"$f":"'Org structure'!E150","v":0},null,null,null,null,null,null,null,0,""]
[{"$f":"'Org structure'!E151","v":0},null,null,null,null,null,null,null,0,""]
[{"$f":"'Org structure'!E152","v":0},null,null,null,null,null,null,null,0,""]
[{"$f":"'Org structure'!E153","v":0},null,null,null,null,null,null,null,0,""]
[{"$f":"'Org structure'!E154","v":0},null,null,null,null,null,null,null,{"$f":"G328-H328","v":0},{"$f":"IF(I328=0,\"\",I328/H328)","v":""}]
[{"$f":"'Org structure'!E155","v":0},null,null,null,null,null,null,null,0,""]
[{"$f":"'Org structure'!A16","v":"Vote 15 - [NAME OF VOTE 15]"},null,{"$f":"SUM(C331:C340)","v":0},0,0,0,0,0,0,"",0]
[{"$f":"'Org structure'!E157","v":"15.1 - [Name of sub-vote]"},null,null,null,null,null,null,null,0,""]
[{"$f":"'Org structure'!E158","v":0},null,null,null,null,null,null,null,0,""]
[{"$f":"'Org structure'!E159","v":0},null,null,null,null,null,null,null,0,""]
[{"$f":"'Org structure'!E160","v":0},null,null,null,null,null,null,null,0,""]
[{"$f":"'Org structure'!E161","v":0},null,null,null,null,null,null,null,0,""]
[{"$f":"'Org structure'!E162","v":0},null,null,null,null,null,null,null,0,""]
[{"$f":"'Org structure'!E163","v":0},null,null,null,null,null,null,null,0,""]
[{"$f":"'Org structure'!E164","v":0},null,null,null,null,null,null,null,0,""]
[{"$f":"'Org structure'!E165","v":0},null,null,null,null,null,null,null,0,""]
[{"$f":"'Org structure'!E166","v":0},null,null,null,null,null,null,null,0,"",null,{"$f":"SUM(L175:L251)","v":0},0,0,0,0,0,0,0,0,0,0,0]
["Total single-year capital expenditure",null,{"$f":"C176+C187+C198+C209+C220+C231+C242+C253+C264+C286+C297+C308+C319+C330+C275","v":15463513.360000003},{"$f":"D176+D187+D198+D209+D220+D231+D242+D253+D264+D286+D297+D308+D319+D330+D275","v":65626000},54166006,1106699.23,29194107.400000002,49652172.166666672,-20458064.766666669,-0.41202758860167088,54166006]
[null,null,null,null,null,null,null,null,0,"",null,{"$f":"L171-L340","v":0},0,0,0,0,0,0,0,0,0,0,0]
["Total Capital Expenditure",null,{"$f":"C172+C341","v":547789828.08999991},{"$f":"D172+D341","v":768760054},802543953.45000005,66307801.809999987,513405543.31999993,735665290.6624999,-222259747.34249997,-0.30212074725225246,802543953.45000005]
[{"$f":"head27a","v":"References"}]
["1. Insert 'Vote'; e.g. Department, if different to standard structure"]

{"sheet":"C6-FinPos","index":14,"n_rows":57,"n_cols":7,"rows_kept":57,"cut":false,"hidden":false,"merged":[[1,0,2,0],[1,1,2,1],[52,0,52,6],[0,0,0,6]]}
[{"$f":"muni& \" - \"&S71E& \" - \"&date","v":"KZN225 Msunduzi - Table C6 Consolidated Monthly Budget Statement - Financial Position  - M11 May"}]
[{"$f":"desc","v":"Description"},{"$f":"head27","v":"Ref"},{"$f":"Head1","v":"2022/23"},{"$f":"Head2","v":"Budget Year 2023/24"}]
[null,null,{"$f":"Head5","v":"Audited Outcome"},{"$f":"Head6","v":"Original Budget"},{"$f":"Head7","v":"Adjusted Budget"},{"$f":"Head39","v":"YearTD actual"},{"$f":"Head8","v":"Full Year Forecast"}]
["R thousands",1]
["ASSETS"]
["Current assets"]
["Cash and cash equivalents",null,511402009,602410696,602410696,-8545560.870000001,{"$f":"E7","v":602410696}]
["Trade and other receivables from exchange transactions",null,2157209998,1296255145.0000019,1296255145.0000019,3379185732.670001,{"$f":"E8","v":1296255145.0000019}]
["Receivables from non-exchange transactions",null,765103881,664796409.80623007,664796409.80623007,45424.75,664796409.80623007]
["Current portion of non-current receivables",null,null,null,null,null,0]
["Inventory",null,420123352,359494469,359494469,505883808.17000002,359494469]
["VAT",null,null,null,null,0,0]
["Other current assets",null,120340430,null,null,529950375.16000032,0]
["Total current assets",null,{"$f":"SUM(C7:C13)","v":3974179670},{"$f":"SUM(D7:D13)","v":2922956719.806232},{"$f":"SUM(E7:E13)","v":2922956719.806232},{"$f":"SUM(F7:F13)","v":4406519779.8800011},{"$f":"SUM(G7:G13)","v":2922956719.806232}]
["Non current assets"]
["Investments",null,null,null,null,null,{"$f":"E16","v":0}]
["Investment property",null,953062121,974255980.81499994,974255980.81499994,928702826.00999999,974255980.81499994]
["Property, plant and equipment",null,7044166606,7923582911,7923582911,7082298702.4300003,7923582911]
["Biological assets",null,null,84450600,84450600,531619.1,84450600]
["Living and non-living resources",null,575890,733076.48699999996,733076.48699999996,null,733076.48699999996]
["Heritage assets",null,274718370,287700639,287700639,null,287700639]
["Intangible assets",null,23913257,20954448,20954448,19095169.829999998,20954448]
["Trade and other receivables from exchange transactions",null,null,0,0,null,0]
["Non-current receivables from non-exchange transactions",null,null,0,0,null,0]
["Other non-current assets",null,75800000,0,0,-914317.72,0]
["Total non current assets",null,{"$f":"SUM(C16:C25)","v":8372236244},{"$f":"SUM(D16:D25)","v":9291677655.302},{"$f":"SUM(E16:E25)","v":9291677655.302},{"$f":"SUM(F16:F25)","v":8029713999.6500006},{"$f":"SUM(G16:G25)","v":9291677655.302}]
["TOTAL ASSETS",null,{"$f":"C14+C26","v":12346415914},{"$f":"D14+D26","v":12214634375.108232},{"$f":"E14+E26","v":12214634375.108232},{"$f":"F14+F26","v":12436233779.530003},{"$f":"G14+G26","v":12214634375.108232}]
["LIABILITIES"]
["Current liabilities"]
["Bank overdraft",null,null,null,null,null,{"$f":"E30","v":0}]
["Financial liabilities",null,74270955,83358533.699999988,83358533.699999988,22312251.550000001,83358533.699999988]
["Consumer deposits",null,142078762,140009384.03399998,140009384.03399998,150358027.54999998,140009384.03399998]
["Trade and other payables from exchange transactions",null,2487458256,1186050665.1830673,1186050665.1830673,2904685390.1500006,1186050665.1830673]
["Trade and other payables from non-exchange transactions",null,15568203,0,0,null,0]
["Provision",null,8979751,49000000,49000000,59294552.420000002,49000000]
["VAT",null,185012600,187551752.47916543,187551752.47916543,null,187551752.47916543]
["Other current liabilities",null,225197859,null,null,null,0]
["Total current liabilities",null,{"$f":"SUM(C30:C37)","v":3138566386},{"$f":"SUM(D30:D37)","v":1645970335.3962326},{"$f":"SUM(E30:E37)","v":1645970335.3962326},{"$f":"SUM(F30:F37)","v":3136650221.6700006},{"$f":"SUM(G30:G37)","v":1645970335.3962326}]
["Non current liabilities"]
["Financial liabilities",null,50310656,131184437.43599999,131184437.43599999,null,{"$f":"E40","v":131184437.43599999}]
["Provision",null,62175173,75576254.600000009,75576254.600000009,null,75576254.600000009]
["Long term portion of trade payables",null,545988000,null,null,166585605.53999999,0]
["Other non-current liabilities",null,null,648252000,648252000,528766165.13999999,648252000]
["Total non current liabilities",null,{"$f":"SUM(C40:C43)","v":658473829},{"$f":"SUM(D40:D43)","v":855012692.03600001},{"$f":"SUM(E40:E43)","v":855012692.03600001},{"$f":"SUM(F40:F43)","v":695351770.67999995},{"$f":"SUM(G40:G43)","v":855012692.03600001}]
["TOTAL LIABILITIES",null,{"$f":"C38+C44","v":3797040215},{"$f":"D38+D44","v":2500983027.4322329},{"$f":"E38+E44","v":2500983027.4322329},{"$f":"F38+F44","v":3832001992.3500004},{"$f":"G38+G44","v":2500983027.4322329}]
["NET ASSETS",2,{"$f":"C27-C45","v":8549375699},{"$f":"D27-D45","v":9713651347.6759987},{"$f":"E27-E45","v":9713651347.6759987},{"$f":"F27-F45","v":8604231787.1800022},{"$f":"G27-G45","v":9713651347.6759987}]
["COMMUNITY WEALTH/EQUITY"]
["Accumulated surplus/(deficit)",null,8329636267,9501123249.9200001,9501123249.9200001,8377487519.3799982,{"$f":"E48","v":9501123249.9200001}]
["Reserves and funds",null,4605111,212528097.75599998,212528097.75599998,226744267.80000001,212528097.75599998]
["Other",null,215134321,null,null,null,0]
["TOTAL COMMUNITY WEALTH/EQUITY",2,{"$f":"SUM(C48:C50)","v":8549375699},{"$f":"SUM(D48:D50)","v":9713651347.6760006},{"$f":"SUM(E48:E50)","v":9713651347.6760006},{"$f":"SUM(F48:F50)","v":8604231787.1799984},{"$f":"SUM(G48:G50)","v":9713651347.6760006}]
[{"$f":"head27a","v":"References"}]
["1. Material variances to be explained in Table SC1"]
["2. Net assets must balance with Total Community Wealth/Equity"]
[]
[]
["check balance",null,{"$f":"C46-C51","v":0},{"$f":"D46-D51","v":0},{"$f":"E46-E51","v":0},{"$f":"F46-F51","v":0},{"$f":"G46-G51","v":0}]

{"sheet":"C7-CFlow","index":15,"n_rows":43,"n_cols":11,"rows_kept":43,"cut":false,"hidden":false,"merged":[[1,0,2,0],[1,1,2,1],[0,0,0,10]]}
[{"$f":"muni& \" - \"&S71F& \" - \"&date","v":"KZN225 Msunduzi - Table C7 Consolidated Monthly Budget Statement - Cash Flow  - M11 May"}]
[{"$f":"desc","v":"Description"},{"$f":"head27","v":"Ref"},{"$f":"Head1","v":"2022/23"},{"$f":"Head2","v":"Budget Year 2023/24"}]
[null,null,{"$f":"Head5","v":"Audited Outcome"},{"$f":"Head6","v":"Original Budget"},{"$f":"Head7","v":"Adjusted Budget"},{"$f":"Head38","v":"Monthly actual"},{"$f":"Head39","v":"YearTD actual"},"YearTD budget",{"$f":"Head41","v":"YTD variance"},{"$f":"Head41","v":"YTD variance"},{"$f":"Head8","v":"Full Year Forecast"}]
["R thousands",1,null,null,null,null,null,null,null,"%"]
["CASH FLOW FROM OPERATING ACTIVITIES"]
["Receipts"]
["Property rates",null,1335259494,1435365977,1435365977,null,null,{"$f":"E7/12*11","v":1315752145.5833335},{"$f":"G7-H7","v":-1315752145.5833335},{"$f":"IF(I7=0,\"\",I7/H7)","v":-1},{"$f":"E7","v":1435365977}]
["Service charges",null,3515849063,4467999174,4467999174,null,null,{"$f":"E8/12*11","v":4095665909.5},-4095665909.5,{"$f":"IF(I8=0,\"\",I8/H8)","v":-1},{"$f":"E8","v":4467999174}]
["Other revenue",null,9652336,1106865000.4299998,1106865000.4299998,null,null,1014626250.3941665,-1014626250.3941665,{"$f":"IF(I9=0,\"\",I9/H9)","v":-1},1106865000.4299998]
["Transfers and Subsidies - Operational",null,795621362,834106196,834106196,null,null,764597346.33333337,-764597346.33333337,{"$f":"IF(I10=0,\"\",I10/H10)","v":-1},834106196]
["Transfers and Subsidies - Capital",null,370294564,452578009,452578009,null,null,414863174.91666669,-414863174.91666669,{"$f":"IF(I11=0,\"\",I11/H11)","v":-1},452578009]
["Interest",null,43019202,18052025,18052025,null,null,16547689.583333334,-16547689.583333334,-1,18052025]
["Dividends",null,null,0,null,null,null,0,0,""]
["Payments"]
["Suppliers and employees",null,-5238024705,-7277163805,-7277163805,null,null,{"$f":"E15/12*11","v":-6670733487.916667},{"$f":"H15-G15","v":-6670733487.916667},1,{"$f":"E15","v":-7277163805}]
["Interest",null,-18837253,-40400878,-40400878,null,null,-37034138.166666672,{"$f":"H16-G16","v":-37034138.166666672},1,-40400878]
["Transfers and Subsidies",null,-22156430,-51023536,-51023536,null,null,-46771574.666666664,{"$f":"H17-G17","v":-46771574.666666664},1,-51023536]
["NET CASH FROM/(USED) OPERATING ACTIVITIES",null,{"$f":"SUM(C7:C13)+SUM(C15:C17)","v":790677633},946378162.43000031,946378162.43000031,0,0,867513315.56083298,{"$f":"H18-G18","v":867513315.56083298},1,{"$f":"SUM(K7:K13)+SUM(K15:K17)","v":946378162.43000031}]
[]
["CASH FLOWS FROM INVESTING ACTIVITIES"]
["Receipts"]
["Proceeds on disposal of PPE",null,3343347,null,null,null,null,null,{"$f":"G22-H22","v":0},{"$f":"IF(I22=0,\"\",I22/H22)","v":""}]
[null,null,0]
["Decrease (increase) in non-current receivables",null,0,null,null,null,null,null,{"$f":"G24-H24","v":0},""]
["Decrease (increase) in non-current investments",null,9415144,null,null,null,null,null,{"$f":"G25-H25","v":0},""]
["Payments"]
["Capital assets",null,-502024054,-768501055,-768501055,null,null,{"$f":"E27/12*11","v":-704459300.41666675},{"$f":"H27-G27","v":-704459300.41666675},1,{"$f":"E27","v":-768501055}]
["NET CASH FROM/(USED) INVESTING ACTIVITIES",null,{"$f":"SUM(C22:C25)+C27","v":-489265563},{"$f":"SUM(D22:D25)+D27","v":-768501055},-768501055,0,0,-704459300.41666675,{"$f":"H28-G28","v":-704459300.41666675},1,{"$f":"SUM(K22:K25)+K27","v":-768501055}]
[]
["CASH FLOWS FROM FINANCING ACTIVITIES"]
["Receipts"]
["Short term loans",null,null,null,null,null,null,null,{"$f":"G32-H32","v":0},{"$f":"IF(I32=0,\"\",I32/H32)","v":""}]
["Borrowing long term/refinancing",null,null,200000000,200000000,null,null,{"$f":"E33/12*11","v":183333333.33333331},{"$f":"G33-H33","v":-183333333.33333331},-1,{"$f":"E33","v":200000000}]
["Increase (decrease) in consumer deposits",null,null,null,null,null,null,null,{"$f":"G34-H34","v":0},""]
["Payments",null,null,null,null,null,null,null,null,""]
["Repayment of borrowing",null,-79162901,-23000000,-23000000,null,null,{"$f":"E36/12*11","v":-21083333.333333336},{"$f":"H36-G36","v":-21083333.333333336},1,{"$f":"E36","v":-23000000}]
["NET CASH FROM/(USED) FINANCING ACTIVITIES",null,{"$f":"SUM(C32:C34)+C36","v":-79162901},177000000,177000000,0,0,162249999.99999997,{"$f":"H37-G37","v":162249999.99999997},1,{"$f":"SUM(K32:K34)+K36","v":177000000}]
[]
["NET INCREASE/ (DECREASE) IN CASH HELD",null,{"$f":"C18+C28+C37","v":222249169},354877107.43000031,354877107.43000031,0,0,325304015.14416623,null,null,{"$f":"K18+K28+K37","v":354877107.43000031}]
["Cash/cash equivalents at beginning:",null,289152840,412002857.26500005,412002857.26500005,null,null,{"$f":"D40/12*6","v":206001428.63250005},null,null,{"$f":"G40","v":0}]
["Cash/cash equivalents at month/year end:",null,{"$f":"C39+C40","v":511402009},{"$f":"D39+D40","v":766879964.69500041},{"$f":"E39+E40","v":766879964.69500041},null,{"$f":"G39+G40","v":0},{"$f":"H39+H40","v":531305443.77666628},null,null,{"$f":"K39+K40","v":354877107.43000031}]
["References"]
["1. Material variances to be explained in Table SC1"]

{"sheet":"SC1","index":16,"n_rows":57,"n_cols":10,"rows_kept":57,"cut":false,"hidden":false,"merged":[[1,0,2,0],[1,1,2,1],[0,0,0,4]]}
[{"$f":"muni& \" - \"&S71G& \" - \"&date","v":"KZN225 Msunduzi - Supporting Table SC1 Material variance explanations  - M11 May"}]
[{"$f":"head27","v":"Ref"},{"$f":"desc","v":"Description"}]
[null,null,"Variance","Reasons for material deviations","Remedial or corrective steps/remarks"]
[null,"R thousands"]
[1,{"$f":"'C4-FinPerf RE'!A5","v":"Revenue"}]
[null,"Agency services",3.9244299928097441,"Actual higher than the projected revenue ","No remedial action is required"]
[null,"Interest earned from Receivables",0.89201434152415282,"Actual higher than the projected revenue ","No remedial action is required"]
[null,"Rental from Fixed Assets",-0.71125957765026093,"Projections higher than the actual revenue ","No remedial action is required"]
[null,"Operational Revenue",-0.65162216409816731,"Projections higher than the actual revenue ","No remedial action is required"]
[null,"Fines, penalties and forfeits",1.3350177166878558,"Actual higher than the projected revenue ","No remedial action is required"]
[null,"Interest",-0.3836105118944767,"Projections higher than the actual revenue ","No remedial action is required"]
[null,"Service charges - Electricity ",-0.36588884682120348,"Projections higher than the actual revenue ","No remedial action is required"]
[]
[]
[]
[]
[null,null,null,null,null,null,null,null,null," `                                                                                                                                                                                                                                                                                                                                       "]
[2,{"$f":"'C4-FinPerf RE'!A34","v":"Expenditure By Type"}]
[null,"Debt impairment",-0.96259494614545449,"Projections higher than the actual expenditure.","This will self correct during the year"]
[null,"Depreciation and amortisation",-0.20932980784717931,"Projections higher than the actual expenditure.","This will self correct during the year"]
[null,"Interest",0.64685690872316881,"AG ordered that Interest on Eskom and Umngeni accounts be added to this item which was not done before and during budgeting and that has caused the actual figure to be higher than the budgeted figure.","This will self correct during the year"]
[null,"Transfers and subsidies",2.4036769130583755,"Actual higher than the projected revenue ","This will self correct during the year"]
[]
[]
[3,{"$f":"RIGHT('C5-Capex'!A40,19)","v":"Capital Expenditure"}]
[null,"Total Capital Funding",-0.3021207472522523,"Projections higher than the actual expenditure.","This will self correct during the year"]
[]
[]
[]
[4,"Financial Position"]
[]
[]
[]
[]
[5,"Cash Flow"]
[]
[]
[]
[]
[6,"Measureable performance"]
[]
[]
[]
[]
[7,"Municipal Entities"]
[]
[]
[]
[]
[]
[{"$f":"head27a","v":"References"}]
["1. Revenue for each source, vote and standard classification"]
["2. Expenditure for each type, vote and standard classification"]
["3. Capital expenditure for each vote and standard classification"]
["4. Explain any material variances between the annual budget and the expected financial position based on current trends"]
["5. Cash receipts by source and cash payments by type where not explained under revenue and expenditure"]
["6. For Sept, Dec, Mar and Jun statements explain any material variances in achievement of measurable performance objectives"]

{"sheet":"SC2","index":17,"n_rows":65,"n_cols":8,"rows_kept":65,"cut":false,"hidden":false,"merged":[[1,0,2,0],[1,1,2,1],[1,2,2,2],[0,0,0,7]]}
[{"$f":"muni& \" - \"&S71H& \" - \"&Head57","v":"KZN225 Msunduzi - Supporting Table SC2 Monthly Budget Statement - performance indicators   - M11 May"}]
["Description of financial indicator","Basis of calculation",{"$f":"head27","v":"Ref"},{"$f":"Head1","v":"2022/23"},{"$f":"Head2","v":"Budget Year 2023/24"}]
[null,null,null,{"$f":"Head5","v":"Audited Outcome"},{"$f":"Head6","v":"Original Budget"},{"$f":"Head7","v":"Adjusted Budget"},{"$f":"Head39","v":"YearTD actual"},{"$f":"Head8","v":"Full Year Forecast"}]
[]
["Borrowing Management"]
[]
["Capital Charges to Operating Expenditure","Interest & principal paid/Operating Expenditure",null,{"$f":"IF(ISERROR((D42-D43)/D45),0,((D42-D43)/D45))","v":1.0295162499138625E-2},{"$f":"IF(ISERROR((E42+E44)/E45),0,((E42+E44)/E45))","v":6.515299759639262E-2},{"$f":"IF(ISERROR((F42+F44)/F45),0,((F42+F44)/F45))","v":6.6479415752330101E-2},{"$f":"IF(ISERROR((G42+G44)/G45),0,((G42+G44)/G45))","v":1.015107021537056E-2},{"$f":"IF(ISERROR((H42+H44)/H45),0,((H42+H44)/H45))","v":1.3630441493936024E-2}]
["Borrowed funding of 'own' capital expenditure","Borrowings/Capital expenditure excl. transfers and grants",null,{"$f":"IF(ISERROR(D47/D46),0,(D47/D46))","v":0},{"$f":"IF(ISERROR(E47/E46),0,(E47/E46))","v":0.26015919916671426},{"$f":"IF(ISERROR(F47/F46),0,(F47/F46))","v":0.14488296809184562},{"$f":"IF(ISERROR(G47/G46),0,(G47/G46))","v":0.40463183513276535},{"$f":"IF(ISERROR(H47/H46),0,(H47/H46))","v":0.22647778449779438}]
["Safety of Capital"]
["Debt to Equity","Loans, Accounts Payable, Overdraft & Tax Provision/ Funds & Reserves",null,{"$f":"IF(ISERROR(D48/D49),0,(D48/D49))","v":0.3073450229011862},{"$f":"IF(ISERROR(E48/E49),0,(E48/E49))","v":0.21092435408537238},{"$f":"IF(ISERROR(F48/F49),0,(F48/F49))","v":0.21092435408537238},{"$f":"IF(ISERROR(G48/G49),0,(G48/G49))","v":0.40163536877155803},{"$f":"IF(ISERROR(H48/H49),0,(H48/H49))","v":0.21092435408537238}]
["Gearing","Long Term Borrowing/ Funds & Reserves",null,{"$f":"IF(ISERROR(D51/D50),0,(D51/D50))","v":0.23385694930563869},{"$f":"IF(ISERROR(E51/E50),0,(E51/E50))","v":0},{"$f":"IF(ISERROR(F51/F50),0,(F51/F50))","v":0},{"$f":"IF(ISERROR(G51/G50),0,(G51/G50))","v":0},{"$f":"IF(ISERROR(H51/H50),0,(H51/H50))","v":0}]
["Liquidity"]
["Current Ratio","Current assets/current liabilities",1,{"$f":"IF(ISERROR(D52/D53),0,(D52/D53))","v":1.2662404363111024},{"$f":"IF(ISERROR(E52/E53),0,(E52/E53))","v":1.7758258803021452},{"$f":"IF(ISERROR(F52/F53),0,(F52/F53))","v":1.7758258803021452},{"$f":"IF(ISERROR(G52/G53),0,(G52/G53))","v":1.4048489530126513},{"$f":"IF(ISERROR(H52/H53),0,(H52/H53))","v":1.7758258803021452}]
["Liquidity Ratio","Monetary Assets/Current Liabilities",null,{"$f":"IF(ISERROR(D54/D53),0,(D54/D53))","v":0.16294127512522208},{"$f":"IF(ISERROR(E54/E53),0,(E54/E53))","v":0.36599122295541392},{"$f":"IF(ISERROR(F54/F53),0,(F54/F53))","v":0.36599122295541392},{"$f":"IF(ISERROR(G54/G53),0,(G54/G53))","v":-2.7244226375519212E-3},{"$f":"IF(ISERROR(H54/H53),0,(H54/H53))","v":0.36599122295541392}]
["Revenue Management"]
["Annual Debtors Collection Rate \n(Payment Level %)","Last 12 Mths Receipts/ Last 12 Mths Billing"]
["Outstanding Debtors to Revenue","Total Outstanding Debtors to Annual Revenue",null,{"$f":"IF(ISERROR(D59/D55),0,(D59/D55))","v":0.47366785060293209},{"$f":"IF(ISERROR(E59/E55),0,(E59/E55))","v":0},{"$f":"IF(ISERROR(F59/F55),0,(F59/F55))","v":0},{"$f":"IF(ISERROR(G59/G55),0,(G59/G55))","v":0},{"$f":"IF(ISERROR(H59/H55),0,(H59/H55))","v":0}]
["Longstanding Debtors Recovered","Debtors > 12 Mths Recovered/Total Debtors > \n12 Months Old",null,{"$f":"IF(ISERROR(D64/D63),0,(D64/D63))","v":0},{"$f":"IF(ISERROR(E64/E63),0,(E64/E63))","v":0},{"$f":"IF(ISERROR(F64/F63),0,(F64/F63))","v":0},{"$f":"IF(ISERROR(G64/G63),0,(G64/G63))","v":0},{"$f":"IF(ISERROR(H64/H63),0,(H64/H63))","v":0}]
["Creditors Management"]
["Creditors System Efficiency","% of Creditors Paid Within Terms (within MFMA s 65(e))"]
["Funding of Provisions"]
["Percentage Of Provisions Not Funded","Unfunded Provisions/Total Provisions"]
["Other Indicators"]
["Electricity Distribution Losses","% Volume (units purchased and generated less units sold)/units purchased and generated",2]
["Water Distribution Losses","% Volume (units purchased and own source less units sold)/Total units purchased and own source",2]
["Employee costs","Employee costs/Total Revenue - capital revenue",null,{"$f":"IF(ISERROR(D40/D55),0,(D40/D55))","v":0.22835405862593641},{"$f":"IF(ISERROR(E40/E55),0,(E40/E55))","v":0.22081133230465741},{"$f":"IF(ISERROR(F40/F55),0,(F40/F55))","v":0.2170363672502876},{"$f":"IF(ISERROR(G40/G55),0,(G40/G55))","v":0.24974802636793328},{"$f":"IF(ISERROR(H40/H55),0,(H40/H55))","v":0.2170363672502876}]
["Repairs & Maintenance","R&M/Total Revenue - capital revenue",null,{"$f":"IF(ISERROR(D41/D55),0,(D41/D55))","v":3.9181541908113106E-2},{"$f":"IF(ISERROR(E41/E55),0,(E41/E55))","v":7.0595469831852359E-2},{"$f":"IF(ISERROR(F41/F55),0,(F41/F55))","v":6.1366459833112875E-2},{"$f":"IF(ISERROR(G41/G55),0,(G41/G55))","v":5.202939532726171E-2},{"$f":"IF(ISERROR(H41/H55),0,(H41/H55))","v":6.1366459833112875E-2}]
["Interest & Depreciation","I&D/Total Revenue - capital revenue",null,{"$f":"IF(ISERROR((D42+D44)/D55),0,((D42+D44)/D55))","v":7.6889213662332645E-2},{"$f":"IF(ISERROR((E42+E44)/E55),0,((E42+E44)/E55))","v":6.1819208772695637E-2},{"$f":"IF(ISERROR((F42+F44)/F55),0,((F42+F44)/F55))","v":6.3578448550965852E-2},{"$f":"IF(ISERROR((G42+G44)/G55),0,((G42+G44)/G55))","v":1.0622919149288982E-2},{"$f":"IF(ISERROR((H42+H44)/H55),0,((H42+H44)/H55))","v":1.3035648906387795E-2}]
["IDP regulation financial viability indicators"]
["i. Debt coverage","(Total Operating Revenue - Operating Grants)/Debt service payments due within financial year)"]
["ii. O/S Service Debtors to Revenue","Total outstanding service debtors/annual revenue received for services"]
["iii. Cost coverage","(Available cash + Investments)/monthly fixed operational expenditure"]
["References"]
["1. Consumer debtors > 12 months old are excluded from current assets."]
["2. Material variances to be explained."]
[]
["Calculations"]
[{"$f":"'C6-FinPos'!A40","v":"Financial liabilities"},null,null,{"$f":"'C6-FinPos'!C40","v":50310656},{"$f":"'C6-FinPos'!D40","v":131184437.43599999},{"$f":"'C6-FinPos'!E40","v":131184437.43599999},{"$f":"'C6-FinPos'!F40","v":0},0]
["Total Assets",null,null,{"$f":"'C6-FinPos'!C27","v":12346415914},{"$f":"'C6-FinPos'!D27","v":12214634375.108232},{"$f":"'C6-FinPos'!E27","v":12214634375.108232},{"$f":"'C6-FinPos'!F27","v":12436233779.530003},{"$f":"'C6-FinPos'!G27","v":12214634375.108232}]
[{"$f":"'C4-FinPerf RE'!A35","v":"Employee related costs"},null,null,{"$f":"'C4-FinPerf RE'!C35","v":1466855856},{"$f":"'C4-FinPerf RE'!D35","v":1793148355},{"$f":"'C4-FinPerf RE'!E35","v":1716571721.6399972},{"$f":"'C4-FinPerf RE'!G35","v":1433891584.5099978},{"$f":"'C4-FinPerf RE'!K35","v":1716571721.6399972}]
[{"$f":"A27","v":"Repairs & Maintenance"},null,null,{"$f":"+SC13c!C173","v":251686677},{"$f":"+SC13c!D173","v":573286476.18856001},{"$f":"+SC13c!E173","v":485356122.30000001},{"$f":"+SC13c!G173","v":298719125.79999995},{"$f":"+SC13c!K173","v":485356122.30000001}]
["Interest (finance charges)",null,null,{"$f":"'C4-FinPerf RE'!C41","v":143221895},{"$f":"'C4-FinPerf RE'!D41","v":40400879.723359942},{"$f":"'C4-FinPerf RE'!E41","v":40400879.723359942},{"$f":"'C4-FinPerf RE'!G41","v":60989928.900000006},{"$f":"'C4-FinPerf RE'!K41","v":40400879.723359942}]
["Principal paid",null,null,{"$f":"-'C7-CFlow'!C36","v":79162901},{"$f":"-'C7-CFlow'!D36","v":23000000},{"$f":"-'C7-CFlow'!E36","v":23000000},{"$f":"-'C7-CFlow'!G36","v":0},{"$f":"-'C7-CFlow'!K36","v":23000000}]
["Depreciation",null,null,{"$f":"'C4-FinPerf RE'!C40","v":350683902},{"$f":"'C4-FinPerf RE'!D40","v":461615984},{"$f":"'C4-FinPerf RE'!E40","v":462450178.23999989},null,{"$f":"'C4-FinPerf RE'!K36","v":62699934.989999995}]
["Operating expenditure",null,null,{"$f":"'C4-FinPerf RE'!C48","v":6222242145.7999992},{"$f":"'C4-FinPerf RE'!D48","v":7705199795},{"$f":"'C4-FinPerf RE'!E48","v":7564011390.1833572},{"$f":"'C4-FinPerf RE'!G48","v":6008226483.119997},{"$f":"'C4-FinPerf RE'!K48","v":7564011390.1833572}]
[{"$f":"'C5-Capex'!A40","v":"Total Capital Expenditure"},null,null,{"$f":"'C5-Capex'!C63","v":547789828.08999991},{"$f":"'C5-Capex'!D63","v":768760054},{"$f":"'C5-Capex'!E63","v":802543953.45000005},{"$f":"'C5-Capex'!F63","v":66307801.810000002},{"$f":"'C5-Capex'!G63","v":513405543.31999999}]
["Borrowed funding for capital",null,null,{"$f":"'C5-Capex'!C72","v":0},{"$f":"'C5-Capex'!D72","v":200000000},{"$f":"'C5-Capex'!E72","v":116274950},{"$f":"'C5-Capex'!G72","v":26830247.530000001},{"$f":"'C5-Capex'!K72","v":116274950}]
["Debt",null,null,{"$f":"'C6-FinPos'!C30+'C6-FinPos'!C31+'C6-FinPos'!C33+'C6-FinPos'!C34+'C6-FinPos'!C40+'C6-FinPos'!C43","v":2627608070},{"$f":"'C6-FinPos'!D30+'C6-FinPos'!D31+'C6-FinPos'!D33+'C6-FinPos'!D34+'C6-FinPos'!D40+'C6-FinPos'!D43","v":2048845636.3190675},{"$f":"'C6-FinPos'!E30+'C6-FinPos'!E31+'C6-FinPos'!E33+'C6-FinPos'!E34+'C6-FinPos'!E40+'C6-FinPos'!E43","v":2048845636.3190675},{"$f":"'C6-FinPos'!F30+'C6-FinPos'!F31+'C6-FinPos'!F33+'C6-FinPos'!F34+'C6-FinPos'!F40+'C6-FinPos'!F43","v":3455763806.8400006},{"$f":"'C6-FinPos'!G30+'C6-FinPos'!G31+'C6-FinPos'!G33+'C6-FinPos'!G34+'C6-FinPos'!G40+'C6-FinPos'!G43","v":2048845636.3190675}]
["Equity",null,null,{"$f":"'C6-FinPos'!C51","v":8549375699},{"$f":"'C6-FinPos'!D51","v":9713651347.6760006},{"$f":"'C6-FinPos'!E51","v":9713651347.6760006},{"$f":"'C6-FinPos'!F51","v":8604231787.1799984},{"$f":"'C6-FinPos'!G51","v":9713651347.6760006}]
[{"$f":"'C6-FinPos'!A49","v":"Reserves and funds"},null,null,{"$f":"'C6-FinPos'!C50","v":215134321},{"$f":"'C6-FinPos'!D50","v":0},{"$f":"'C6-FinPos'!E50","v":0},{"$f":"'C6-FinPos'!F50","v":0},{"$f":"'C6-FinPos'!G50","v":0}]
["Borrowing",null,null,{"$f":"'C6-FinPos'!C40","v":50310656},{"$f":"'C6-FinPos'!D40","v":131184437.43599999},{"$f":"'C6-FinPos'!E40","v":131184437.43599999},{"$f":"'C6-FinPos'!F40","v":0},{"$f":"'C6-FinPos'!G40","v":131184437.43599999}]
[{"$f":"'C6-FinPos'!A6","v":"Current assets"},null,null,{"$f":"'C6-FinPos'!C14","v":3974179670},{"$f":"'C6-FinPos'!D14","v":2922956719.806232},{"$f":"'C6-FinPos'!E14","v":2922956719.806232},{"$f":"'C6-FinPos'!F14","v":4406519779.8800011},{"$f":"'C6-FinPos'!G14","v":2922956719.806232}]
[{"$f":"'C6-FinPos'!A29","v":"Current liabilities"},null,null,{"$f":"'C6-FinPos'!C38","v":3138566386},{"$f":"'C6-FinPos'!D38","v":1645970335.3962326},{"$f":"'C6-FinPos'!E38","v":1645970335.3962326},{"$f":"'C6-FinPos'!F38","v":3136650221.6700006},{"$f":"'C6-FinPos'!G38","v":1645970335.3962326}]
["Monetary assets",null,null,{"$f":"'C6-FinPos'!C7","v":511402009},{"$f":"'C6-FinPos'!D7","v":602410696},{"$f":"'C6-FinPos'!E7","v":602410696},{"$f":"'C6-FinPos'!F7","v":-8545560.870000001},{"$f":"'C6-FinPos'!G7","v":602410696}]
[{"$f":"'C4-FinPerf RE'!A33","v":"Total Revenue (excluding capital transfers and contributions)"},null,null,{"$f":"'C4-FinPerf RE'!C33","v":6423603174.9399996},{"$f":"'C4-FinPerf RE'!D33","v":8120726125.260458},{"$f":"'C4-FinPerf RE'!E33","v":7909143261.969717},{"$f":"'C4-FinPerf RE'!G33","v":5741353016.329999},{"$f":"'C4-FinPerf RE'!K33","v":7909143261.969717}]
[{"$f":"'C4-FinPerf RE'!A26","v":"Transfers and subsidies - Operational"},null,null,{"$f":"'C4-FinPerf RE'!C26","v":801751325},{"$f":"'C4-FinPerf RE'!D28","v":0},{"$f":"'C4-FinPerf RE'!E28","v":0},{"$f":"'C4-FinPerf RE'!G28","v":0},{"$f":"'C4-FinPerf RE'!K28","v":0}]
[{"$f":"'C4-FinPerf RE'!A50","v":"Transfers and subsidies - capital (monetary allocations)"},null,null,{"$f":"'C4-FinPerf RE'!C50","v":324319270},{"$f":"'C4-FinPerf RE'!D50","v":448700054.94999999},{"$f":"'C4-FinPerf RE'!E50","v":536156203.44999993},{"$f":"'C4-FinPerf RE'!G50","v":365842655.19999999},{"$f":"'C4-FinPerf RE'!K50","v":536156203.44999993}]
["Debt service payments",null,null,{"$f":"'C7-CFlow'!C12+'C7-CFlow'!C36","v":-36143699},{"$f":"'C7-CFlow'!D12+'C7-CFlow'!D36","v":-4947975},{"$f":"'C7-CFlow'!E12+'C7-CFlow'!E36","v":-4947975},{"$f":"'C7-CFlow'!G16+'C7-CFlow'!G36","v":0},{"$f":"'C7-CFlow'!K16+'C7-CFlow'!K36","v":-63400878}]
["Outstanding debtors (receivables)",null,null,{"$f":"'C6-FinPos'!C8+'C6-FinPos'!C9+'C6-FinPos'!C10+'C6-FinPos'!C13+'C6-FinPos'!C23+'C6-FinPos'!C24","v":3042654309},0,0,0,0]
["Annual services revenue",null,null,{"$f":"'C4-FinPerf RE'!C7+'C4-FinPerf RE'!C8+'C4-FinPerf RE'!C9+'C4-FinPerf RE'!C10+'C4-FinPerf RE'!C22","v":5240670634},{"$f":"'C4-FinPerf RE'!D7+'C4-FinPerf RE'!D8+'C4-FinPerf RE'!D9+'C4-FinPerf RE'!D10+'C4-FinPerf RE'!D22","v":6662616316.1222992},{"$f":"'C4-FinPerf RE'!E7+'C4-FinPerf RE'!E8+'C4-FinPerf RE'!E9+'C4-FinPerf RE'!E10+'C4-FinPerf RE'!E22","v":6443152976.9515572},{"$f":"'C4-FinPerf RE'!F7+'C4-FinPerf RE'!F8+'C4-FinPerf RE'!F9+'C4-FinPerf RE'!F10+'C4-FinPerf RE'!F22","v":52745938.309999987},{"$f":"'C4-FinPerf RE'!G7+'C4-FinPerf RE'!G8+'C4-FinPerf RE'!G9+'C4-FinPerf RE'!G10+'C4-FinPerf RE'!G22","v":4403586025.2699995}]
["Cash + investments","Including LT investments",null,{"$f":"'C6-FinPos'!C7+'C6-FinPos'!C16-'C6-FinPos'!C30","v":511402009},{"$f":"'C6-FinPos'!D7+'C6-FinPos'!D16-'C6-FinPos'!D30","v":602410696},{"$f":"'C6-FinPos'!E7+'C6-FinPos'!E16-'C6-FinPos'!E30","v":602410696},{"$f":"'C6-FinPos'!F7+'C6-FinPos'!F16-'C6-FinPos'!F30","v":-8545560.870000001},{"$f":"'C6-FinPos'!G7+'C6-FinPos'!G16-'C6-FinPos'!G30","v":602410696}]
["Fixed operational expend. (monthly)"]
["Longstanding debtors outstanding",null,null,{"$f":"'C6-FinPos'!C23+'C6-FinPos'!C24","v":0},{"$f":"'C6-FinPos'!D23+'C6-FinPos'!D24","v":0},{"$f":"'C6-FinPos'!E23+'C6-FinPos'!E24","v":0},{"$f":"'C6-FinPos'!F23+'C6-FinPos'!F24","v":0},{"$f":"'C6-FinPos'!G23+'C6-FinPos'!G24","v":0}]
["Longstanding debtors recovered"]
["Attorney collections"]

{"sheet":"SC3","index":18,"n_rows":27,"n_cols":14,"rows_kept":27,"cut":false,"hidden":false,"merged":[[0,0,0,12],[1,2,1,13]]}
[{"$f":"muni& \" - \"&S71I& \" - \"&Head57","v":"KZN225 Msunduzi - Supporting Table SC3 Monthly Budget Statement - aged debtors - M11 May"}]
[{"$f":"desc","v":"Description"},null,{"$f":"Head2","v":"Budget Year 2023/24"}]
["R thousands","NT Code","0-30 Days","31-60 Days","61-90 Days","91-120 Days","121-150 Dys","151-180 Dys","181 Dys-1 Yr","Over 1Yr","Total","Total \nover 90 days","Actual Bad Debts Written Off against Debtors","Impairment - Bad Debts i.t.o Council Policy"]
["Debtors Age Analysis By Income Source"]
["Trade and Other Receivables from Exchange Transactions - Water",1200,129847546.44999999,43159781.170000002,44717456.560000002,43705929.990000002,44971072.469999999,40647931.43,232548681.81999999,2245521173.1700001,{"$f":"SUM(C5:J5)","v":2825119573.0599999},{"$f":"SUM(F5:J5)","v":2607394788.8800001},null,1702787169.2]
["Trade and Other Receivables from Exchange Transactions - Electricity",1300,119811668.75,22087113.34,25386397.030000001,25418406.52,19368988.550000001,15495542.869999999,116936125.93000001,271589979.79000002,{"$f":"SUM(C6:J6)","v":616094222.77999997},{"$f":"SUM(F6:J6)","v":448809043.66000003},null,156851604.06999999]
["Receivables from Non-exchange Transactions - Property Rates",1400,127648978.03,25950891.57,27051484.129999999,24879071.510000002,23989374.32,23148430.510000002,126399764.42,857914732.17999995,{"$f":"SUM(C7:J7)","v":1236982726.6699998},1056331372.9399999,null,658489422.24000001]
["Receivables from Exchange Transactions - Waste Water Management",1500,28466986.759999998,7571650.8499999996,7747039.0599999996,7358665.2800000003,6673026.6799999997,6486277.46,38254747.479999997,316834503.66000003,419392897.23000002,375607220.56,null,260291680.83000001]
["Receivables from Exchange Transactions - Waste Management",1600,14353802.85,3835200.92,3690768.31,3457089.16,3312428.42,3274305.12,17998119.079999998,174289603.5,224211317.36000001,{"$f":"SUM(F9:J9)","v":202331545.28},null,144208014.16]
["Receivables from Exchange Transactions - Property Rental Debtors",1700,10652.58,910241.92,956666.29,795272.33,828656.06,1030806.18,6047654.0999999996,49220489.630000003,59800439.090000004,{"$f":"SUM(F10:J10)","v":57922878.300000004},null,42600982.340000004]
["Interest on Arrear Debtor Accounts",1810,74609136.030000001,34861040.079999998,37964170.329999998,36947506.539999999,35102697.079999998,36138666.560000002,176825881.81999999,1033242062.3,1465691160.74,1318256814.3,null,797797936.23000002]
["Recoverable unauthorised, irregular, fruitless and wasteful expenditure",1820,null,null,null,null,null,null,null,null,0,0]
["Other",1900,-3458789.35,241610.01,310316.71999999997,103082.57,161335.53,102085.44,1111063.48,172767085.56,171337789.96000001,{"$f":"SUM(F13:J13)","v":174244652.58000001},null,171544475.56999999]
["Total By Income Source",2000,{"$f":"SUM(C5:C13)","v":491289982.10000002},138617529.86000001,147824298.43000001,142665023.90000001,134407579.11000001,126324045.57000001,716122038.13000011,5121379629.79,7018630126.8899994,{"$f":"SUM(L5:L13)","v":6240898316.5},0,3934571284.6400003]
[{"$f":"Head1&\" - totals only\"","v":"2022/23 - totals only"},null,494939284.85000002,120252017.13999999,123613075.31,103046643.31999999,107754208.46999997,111014020.16,688016753.56000006,4214989341.5500002,{"$f":"SUM(C15:J15)","v":5963625344.3600006},{"$f":"SUM(F15:J15)","v":5224820967.0600004},null,3325888512.6499996]
["Debtors Age Analysis By Customer Group"]
["Organs of State",2200,43784108.439999998,6973325.3300000001,13046660.380000001,9737427.9600000009,6743975.2599999998,5519445.8099999996,25477769.550000001,107187777.92,{"$f":"SUM(C17:J17)","v":218470490.65000001},{"$f":"SUM(F17:J17)","v":154666396.5},null,83695473.730000004]
["Commercial",2300,194231400.78,28227393.18,27589811.210000001,23563590.73,26039229.399999999,22743642.210000001,135173072.71000001,655745524.00999999,{"$f":"SUM(C18:J18)","v":1113313664.23},{"$f":"SUM(F18:J18)","v":863265059.05999994},null,486588267.20999998]
["Households",2400,253274472.88,103416811.34999999,107187826.84,109364005.20999999,101624374.45,98060957.549999997,555471195.87,4358446327.8599997,{"$f":"SUM(C19:J19)","v":5686845972.0100002},{"$f":"SUM(F19:J19)","v":5222966860.9399996},null,3364287543.6999998]
["Other",2500,null,null,null,null,null,null,null,null,{"$f":"SUM(C20:J20)","v":0},{"$f":"SUM(F20:J20)","v":0}]
["Total By Customer Group",2600,{"$f":"SUM(C17:C20)","v":491289982.10000002},138617529.85999998,147824298.43000001,142665023.90000001,134407579.11000001,126324045.56999999,716122038.13,{"$f":"SUM(J17:J20)","v":5121379629.79},{"$f":"SUM(K17:K20)","v":7018630126.8900003},{"$f":"SUM(L17:L20)","v":6240898316.5},{"$f":"SUM(M17:M20)","v":0},{"$f":"SUM(N17:N20)","v":3934571284.6399999}]
["Notes"]
["Material increases in value of debtors' categories compared to previous month to be explained"]
["Bad debts = amounts actually written off in the month"]
["Total by Income Source must reconcile with Total by Customer Group"]
[null,null,{"$f":"C14-C21","v":0},{"$f":"D14-D21","v":0},{"$f":"E14-E21","v":0},0,0,0,0,{"$f":"J14-J21","v":0},0]
[null,null,{"$f":"IF(C26=0,\"\",\"MUST AGREE\")","v":""},{"$f":"IF(D26=0,\"\",\"MUST AGREE\")","v":""},"","","","","","",""]

{"sheet":"SC4","index":19,"n_rows":17,"n_cols":12,"rows_kept":17,"cut":false,"hidden":false,"merged":[[1,1,3,1],[2,2,3,2],[2,3,3,3],[1,11,3,11],[0,0,0,10],[2,8,3,8],[2,9,3,9],[2,10,3,10],[2,4,3,4],[2,5,3,5],[2,6,3,6],[2,7,3,7],[1,0,2,0]]}
[{"$f":"muni& \" - \"&S71J& \" - \"&Head57","v":"KZN225 Msunduzi - Supporting Table SC4 Monthly Budget Statement - aged creditors  - M11 May"}]
[{"$f":"desc","v":"Description"},"NT Code",{"$f":"Head2","v":"Budget Year 2023/24"},null,null,null,null,null,null,null,null,"Prior year totals for chart (same period)"]
[null,null,"0 - \n30 Days","31 - \n60 Days","61 - \n90 Days","91 - \n120 Days","121 - \n150 Days","151 - \n180 Days","181 Days -\n1 Year","Over 1\nYear","Total\n"]
["R thousands"]
["Creditors Age Analysis By Customer Type"]
["Bulk Electricity","0100",401278328.93000001,5974.26,-20794760.879999999,0,986659280.32000005,null,null,null,{"$f":"SUM(C6:J6)","v":1367148822.6300001},650213111.24000001]
["Bulk Water","0200",123754607.23999999,-51732193.369999997,18984796.829999998,12607345.380000001,517333456.89999998,null,null,null,{"$f":"SUM(C7:J7)","v":620948012.98000002},643652270.55999994]
["PAYE deductions","0300",null,null,null,null,null,null,null,null,0,0]
["VAT (output less input)","0400",null,null,null,null,null,null,null,null,0,0]
["Pensions / Retirement deductions","0500",null,null,null,null,null,null,null,null,0,0]
["Loan repayments","0600",null,null,null,null,null,null,null,null,0,0]
["Trade Creditors","0700",null,null,null,null,null,null,null,null,0,0]
["Auditor General","0800",null,null,null,null,null,null,null,null,0,0]
["Other","0900",97228808.00999999,18902099.379999999,19151177.18,20299.259999999998,2997424.5300000003,null,null,null,{"$f":"SUM(C14:J14)","v":138299808.35999998},69842286.349999994]
["Total By Customer Type",1000,{"$f":"SUM(C6:C14)","v":622261744.18000007},{"$f":"SUM(D6:D14)","v":-32824119.73},17341213.129999999,12627644.640000001,1506990161.75,0,0,0,{"$f":"SUM(K6:K14)","v":2126396643.97},{"$f":"SUM(L6:L14)","v":1363707668.1499999}]
["Notes"]
["Material increases in value of creditors' categories compared to previous month to be explained"]

{"sheet":"SC5","index":20,"n_rows":36,"n_cols":15,"rows_kept":36,"cut":false,"hidden":false,"merged":[[2,10,2,14],[0,0,0,9],[1,1,2,1],[1,3,2,3],[1,9,2,9]]}
[{"$f":"muni& \" - \"&S71K& \" - \"&Head57","v":"KZN225 Msunduzi - Supporting Table SC5 Monthly Budget Statement - investment portfolio  - M11 May"}]
["Investments by maturity\nName of institution & investment ID","Ref","Period of Investment","Type of Investment","Capital Guarantee\n(Yes/ No)","Variable or Fixed interest rate","Interest Rate ᶟ","Commission Paid (Rands)","Commission Recipient","Expiry date of investment","Opening balance","Interest to be realised","Partial / Premature Withdrawal (4)","Investment Top Up","Closing Balance"]
["R thousands",null,"Yrs/Months"]
["Municipality"]
["Municipal Infrastructure Grant",null,null,null,null,null,null,null,null,null,65604866.759999998,null,-7402886.4300000006,null,{"$f":"SUM(K5:N5)","v":58201980.329999998}]
["Unspent Conditional Grant",null,null,null,null,null,null,null,null,null,230068254.12999994,null,-111447166.04000001,87218706.480000004,{"$f":"SUM(K6:N6)","v":205839794.56999993}]
["Housing Accreditation",null,null,null,null,null,null,null,null,null,9277994.4699999951,61369.13,-872317.2,null,8467046.3999999966]
["Municipal Housing Account",null,null,null,null,null,null,null,null,null,51827921.310000002,355271.82,-389551.47,120862.7,51914504.360000007]
["Housing  Projects: Principal-Agent ",null,null,null,null,null,null,null,null,null,15505471.609999999,null,null,33220.629999999997,15538692.24]
["Compensation Fund (COID)1131010020",null,null,null,null,null,null,null,null,null,332152.07,2285.02,null,null,334437.09000000003]
["Compensation Fund (COID)",null,null,null,null,null,null,null,null,null,23584673,null,null,null,23584673]
["Airport Development Fund",null,null,null,null,null,null,null,null,null,28030.190000000002,192.83,null,null,28223.020000000004]
["Insurance Fund",null,null,null,null,null,null,null,null,null,7753966.2000000002,53343.040000000001,null,null,7807309.2400000002]
["Vat Recovery on  Prov. Grants",null,null,null,null,null,null,null,null,null,1010668.3200000001,null,null,6952.85,{"$f":"SUM(K14:N14)","v":1017621.17}]
["Vat Refunds ",null,null,null,null,null,null,null,null,null,4950216.4799999986,34054.769999999997,null,null,4984271.2499999981]
["Call - General Reserves",null,null,null,null,null,null,null,null,null,48221000,null,-223430000,202648836.16999999,27439836.169999987]
["7 Day Notice - General Reserves",null,null,null,null,null,null,null,null,null,77524008.749999985,270832.40000000002,-70000000,null,7794841.1499999911]
["1 Day Notice - General Reserves",null,null,null,null,null,null,null,null,null,32103357.800000001,16236.060000000001,-32000000,null,119593.8599999994]
["Call Account-Loan",null,null,null,null,null,null,null,null,null,107753298.28,737767.18,-19046881.210000001,null,{"$f":"SUM(K19:N19)","v":89444184.25}]
["Municipality sub-total",null,null,null,null,null,null,null,null,null,{"$f":"SUM(K5:K19)","v":675545879.36999989},{"$f":"SUM(L5:L19)","v":1531352.25},{"$f":"SUM(M5:M19)","v":-464588802.34999996},{"$f":"SUM(N5:N19)","v":290028578.82999998},{"$f":"SUM(O5:O19)","v":502517008.0999999}]
[]
["Entities"]
[null,null,null,null,null,null,null,null,null,null,null,null,null,null,{"$f":"SUM(K23:N23)","v":0}]
[null,null,null,null,null,null,null,null,null,null,null,null,null,null,0]
[null,null,null,null,null,null,null,null,null,null,null,null,null,null,0]
[null,null,null,null,null,null,null,null,null,null,null,null,null,null,0]
[null,null,null,null,null,null,null,null,null,null,null,null,null,null,0]
[null,null,null,null,null,null,null,null,null,null,null,null,null,null,0]
[null,null,null,null,null,null,null,null,null,null,null,null,null,null,0]
["Entities sub-total",null,null,null,null,null,null,null,null,null,{"$f":"SUM(K23:K29)","v":0},null,{"$f":"SUM(M23:M29)","v":0},{"$f":"SUM(N23:N29)","v":0},{"$f":"SUM(O23:O29)","v":0}]
[]
["TOTAL INVESTMENTS AND INTEREST",2,null,null,null,null,null,null,null,null,{"$f":"K20+K30","v":675545879.36999989},{"$f":"L20+L30","v":1531352.25},{"$f":"M20+M30","v":-464588802.34999996},{"$f":"N20+N30","v":290028578.82999998},{"$f":"O20+O30","v":502517008.0999999}]
[{"$f":"head27a","v":"References"}]
["2. List investments in expiry date order"]
["3. If 'variable' is selected in column F, input interest rate range"]
["4. Withdrawals to be entered as negative"]

{"sheet":"SC6","index":21,"n_rows":129,"n_cols":11,"rows_kept":129,"cut":false,"hidden":false,"merged":[[1,0,2,0],[1,1,2,1],[0,0,0,10]]}
[{"$f":"muni& \" - \"&S71L& \" - \"&Head57","v":"KZN225 Msunduzi - Supporting Table SC6 Monthly Budget Statement - transfers and grant receipts  - M11 May"}]
[{"$f":"desc","v":"Description"},{"$f":"head27","v":"Ref"},{"$f":"Head1","v":"2022/23"},{"$f":"Head2","v":"Budget Year 2023/24"}]
[null,null,{"$f":"Head5","v":"Audited Outcome"},{"$f":"Head6","v":"Original Budget"},{"$f":"Head7","v":"Adjusted Budget"},{"$f":"Head38","v":"Monthly actual"},{"$f":"Head39","v":"YearTD actual"},"YearTD budget",{"$f":"Head41","v":"YTD variance"},{"$f":"Head41","v":"YTD variance"},{"$f":"Head8","v":"Full Year Forecast"}]
["R thousands",null,null,null,null,null,null,null,null,"%"]
["RECEIPTS:","1,2"]
[]
["Operating Transfers and Grants"]
["National Government:",null,{"$f":"SUM(C9:C28)","v":765766721.62},805981360,796838701.98000002,0,800509657,730435476.81499994,70074180.185000077,{"$f":"IF(I8=0,\"\",I8/H8)","v":9.5934798362413087E-2},{"$f":"SUM(K9:K28)","v":796838701.98000002}]
["Local Government Equitable Share",null,696056000,767222000,767222000,null,767222000,{"$f":"E9/12*11","v":703286833.33333325},{"$f":"G9-H9","v":63935166.666666746},9.0909090909091037E-2,{"$f":"E9","v":767222000}]
["Finance Management ",null,1950000,1950000,1950000,null,1950000,{"$f":"E10/12*11","v":1787500},162500,9.0909090909090912E-2,{"$f":"E10","v":1950000}]
["Municipal Systems Improvement",null,null,null,null,null,null,null,0,"",0]
["EPWP Incentive",null,5228150.62,4979000,4701000.0000000009,null,4701000,{"$f":"E12/12*11","v":4309250.0000000009},391749.99999999907,9.0909090909090676E-2,4701000.0000000009]
["Water Services Operating Subsidy ",null,55555264,null,null,null,null,null,0,"",0]
["Public Transport Infrastracture",null,null,null,null,null,null,null,0,"",0]
["Energy Efficiency  and Demand Management",null,null,null,null,null,null,null,0,"",0]
["Municipal Water Infrastructure Grant",null,null,22000000,13944900,null,17603900,{"$f":"E16/12*11","v":12782825},4821075,0.37715254648326957,13944900]
["Operating costs-MIG",null,6977307,9830360,9020801.9800000004,null,9032757,8269068.4816666674,763688.51833333261,9.2354842631489228E-2,9020801.9800000004]
[null,null,null,null,null,null,null,null,0,""]
[null,null,null,null,null,null,null,null,0,""]
[null,null,null,null,null,null,null,null,0,""]
[null,null,null,null,null,null,null,null,0,""]
[null,null,null,null,null,null,null,null,0,""]
[null,3,null,null,null,null,null,null,0,""]
[null,null,null,null,null,null,null,null,0,""]
[null,null,null,null,null,null,null,null,0,""]
[null,null,null,null,null,null,null,null,0,""]
[null,null,null,null,null,null,null,null,0,""]
["Other transfers and grants [insert description]",null,null,null,null,null,null,null,0,""]
["Provincial Government:",null,{"$f":"SUM(C30:C55)","v":35984604.369999997},32002789.91,49176923.900000118,9487.5,20506663.68,45078846.908333443,-24572183.228333443,-0.54509342881596512,{"$f":"SUM(K30:K55)","v":49176923.900000118}]
["Provincial Government:",null,null,null,null,null,null,null,{"$f":"G30-H30","v":0},"",{"$f":"E30","v":0}]
["Expanded Public Works Grant",null,null,null,null,null,null,null,0,"",0]
["Sport and Recreation",null,null,null,null,null,null,null,0,"",0]
["Human Settlements - Title Deeds Restoration ",null,null,null,null,null,null,null,0,"",0]
["Housing Accreditation-OPERATING",null,null,null,null,null,913346.97999999986,null,913346.97999999986,{"$error":"#DIV/0!"},0]
["Human Settlements -  Accredited Municipal RO",null,null,null,2789415.0600000024,null,null,{"$f":"E35/12*11","v":2556963.8050000025},-2556963.8050000025,-1,2789415.0600000024]
["Human Settlements -  Housing Development",null,2831371,null,null,null,928977.63,null,928977.63,{"$error":"#DIV/0!"},0]
["Arts and Culture- Community Library Services",null,16172386,null,14678177.370000115,null,13538000,{"$f":"E37/12*11","v":13454995.922500106},83004.077499894425,6.1690154332258787E-3,14678177.370000115]
["Arts and Culture- Provincialisation",null,null,null,null,null,null,null,0,"",0]
["Arts and Culture-Museum Subsidies",null,null,13657999.91,null,null,null,{"$f":"E39/12*11","v":0},0,"",0]
["Arts and Culture-Museum Subsidies - Tatham Art Gallery ",null,91266,null,null,null,120000,0,120000,{"$error":"#DIV/0!"},0]
["Tatham Art Gallery-OPERATING- ART BANK",null,null,null,null,null,57000,0,{"$f":"G41-H41","v":57000},{"$f":"IF(I41=0,\"\",I41/H41)","v":{"$error":"#DIV/0!"}},0]
["COGTA",null,null,null,null,null,null,0,0,"",0]
["Municipal Employment Initiative - OPERATING",null,null,null,1099830,null,null,1008177.5,-1008177.5,-1,1099830]
["Housing Projects -OPERATING",null,2050695,18344790,27351379.469999999,null,1181354,25072097.8475,-23890743.8475,-0.95288172504807789,27351379.469999999]
["Greater Edendale Development Iniatative",null,14670904.369999999,null,3049427,-43012.5,287448.26,2795308.083333333,{"$f":"G45-H45","v":-2507859.8233333332},{"$f":"IF(I45=0,\"\",I45/H45)","v":-0.89716759246901145},3049427]
["SETA- Bursaries for Non Employees- OPERATING",null,167982,null,208695,52500,2480536.81,191303.75,2289233.06,11.966482936168267,208695]
["Municipal Employment Initiative - OPERATING",null,null,null,null,null,1000000,0,{"$f":"G47-H47","v":1000000},{"$f":"IF(I47=0,\"\",I47/H47)","v":{"$error":"#DIV/0!"}},0]
[null,null,null,null,null,null,null,0,0,"",0]
["Informal Economy Instructure Development",null,null,null,null,null,null,null,0,"",0]
[]
[]
[null,null,null,null,null,null,null,null,0,""]
[null,4,null,null,null,null,null,null,0,""]
[null,null,null,null,null,null,null,null,0,""]
["Other transfers and grants [insert description]",null,null,null,null,null,null,null,0,""]
["District Municipality:",null,{"$f":"SUM(C57:C58)","v":0},0,0,0,0,0,0,"",{"$f":"SUM(K57:K58)","v":0}]
["[insert description]",null,null,null,null,null,null,null,0,""]
[null,null,null,null,null,null,null,null,0,""]
["Other grant providers:",null,{"$f":"SUM(C60:C66)","v":0},0,0,0,0,0,0,"",{"$f":"SUM(K60:K66)","v":0}]
["[insert description]",null,null,null,null,null,null,null,0,""]
[]
[]
[]
[]
[]
[null,null,null,null,null,null,null,null,0,""]
["Total Operating Transfers and Grants",5,{"$f":"C8+C29+C56+C59","v":801751325.99000001},837984149.90999997,846015625.88000011,9487.5,821016320.67999995,775514323.72333336,45501996.956666633,5.8673315972045906E-2,{"$f":"K8+K29+K56+K59","v":846015625.88000011}]
[]
["Capital Transfers and Grants"]
[{"$f":"A8","v":"National Government:"},null,{"$f":"SUM(C71:C80)","v":286472367.39999998},312534640,296019602,0,284944343,271351301.83333331,13593041.166666673,{"$f":"IF(I70=0,\"\",I70/H70)","v":5.0093885950897907E-2},296019602]
[" Municipal Infrastructure Grant (MIG)",null,220148988.53999996,238928640,224358502,null,220289243,{"$f":"E71/12*11","v":205661960.16666666},{"$f":"G71-H71","v":14627282.833333343},7.112293795838337E-2,{"$f":"E71","v":224358502}]
[" Public Transport and Systems",null,0,null,null,null,null,0,0,"",0]
["Neighbourhood Development Partnership",null,34499416.369999997,33606000,23606000,null,13100000,21638833.333333336,-8538833.3333333358,-0.39460691811788995,23606000]
["Dept of Mineral/Electricty",null,0,null,null,null,null,0,0,"",0]
["Intergrated National Electrification Porgramme",null,27379642.989999998,7000000,7000000,null,10500000,6416666.666666667,4083333.333333333,0.63636363636363624,7000000]
["Municipal Systems Improvement",null,null,null,null,null,null,0,0,"",0]
["Water Services Infrastructure Grant ",null,4444319.5,28000000,36055100,null,36055100,33050508.333333332,3004591.6666666679,9.0909090909090953E-2,36055100]
["Energy Efficiency and Demand Manaagement",null,0,5000000,5000000,null,5000000,4583333.333333334,416666.66666666605,9.0909090909090759E-2,5000000]
["  Other capital transfers/grants [insert desc]",null,null,null,null,null,null,0,0,"",0]
[null,null,null,null,null,null,null,null,0,""]
[{"$f":"A29","v":"Provincial Government:"},null,{"$f":"SUM(C82:C110)","v":37846903.07},136165414.94999999,240136601.45000002,456721.50999999978,154460530.97999999,220125217.99583334,-65664687.015833348,{"$f":"IF(I81=0,\"\",I81/H81)","v":-0.29830606240251989},{"$f":"SUM(K82:K110)","v":233312000.45000002}]
["Airport Development Project",null,null,null,null,null,null,null,0,{"$f":"IF(I82=0,\"\",I82/H82)","v":""}]
["Sport and Recreation",null,null,null,null,null,null,null,0,{"$f":"IF(I83=0,\"\",I83/H83)","v":""}]
["KZNPA",null,null,null,null,null,null,null,0,""]
["Economic development tourism",null,null,null,null,null,null,null,0,""]
["Capital Provincial KZN Treausry",null,null,null,null,null,null,null,0,""]
["KZN-Military Veterans",null,null,null,6824601,null,null,{"$f":"E87/12*11","v":6255884.25},-6255884.25,-1]
["Airport Grant",null,null,null,null,null,null,null,0,""]
["Arts and Culture-Museum Subsidies",null,null,null,null,null,null,null,0,""]
["COGTA",null,null,null,null,null,null,null,0,""]
["Human Settlement",null,null,null,null,null,null,null,0,""]
["Human Settlement - Housing Accreditation",null,417555,700000,700000,null,null,{"$f":"E92/12*11","v":641666.66666666674},-641666.66666666674,-1,{"$f":"E92","v":700000}]
["Jika Joe Community Residential Units-CAPITAL",null,null,null,25386788.579999998,null,null,23271222.864999998,-23271222.864999998,-1,25386788.579999998]
["Provincial Government:",null,null,null,null,null,null,0,0,"",0]
["Arts and Culture- Community Library Services",null,null,420000,null,null,900000,0,900000,{"$error":"#DIV/0!"},0]
["Arts and Culture-Museum Subsidies - Tatham Art Gallery ",null,347778.71,null,1283206,null,451000,1176272.1666666665,-725272.16666666651,-0.61658533392144355,1283206]
["PMB Airport- CAPITAL",null,2874671,3000000,3274159,null,3000000,3001312.4166666665,-1312.4166666665114,-4.3728092396462829E-4,3274159]
["Housing Projects -Capital",null,null,14850000,116195414.95,null,null,106512463.70416667,-106512463.70416667,-1,116195414.95]
["Human Settlement",null,5021543,116195414.95,null,null,null,0,0,"",0]
["Greater Edendale Development Iniatative-CAPITAL",null,11683354,null,85458849.140000001,456721.50999999978,2578201.37,78337278.37833333,{"$f":"G100-H100","v":-75759077.008333325},{"$f":"IF(I100=0,\"\",I100/H100)","v":-0.96708844852193532},85458849.140000001]
["Operation Dlulisumlando-Capital",null,null,null,null,null,null,0,0,"",0]
["Youth Enterprise Park-CAPITAL",null,197683,null,null,null,null,0,0,"",0]
["Eastwood Primary Substation-CAPITAL",null,16130468,null,null,null,null,0,0,"",0]
["Municipal Disaster Response Grant",null,620000,null,null,null,39600000,0,39600000,{"$error":"#DIV/0!"},0]
["Corridor Development",null,487435,null,null,null,null,0,null,null,0]
["Upgrading Informal Settlements- CAPITAL",null,null,null,null,null,106931329.61,0,{"$f":"G106-H106","v":106931329.61},{"$f":"IF(I106=0,\"\",I106/H106)","v":{"$error":"#DIV/0!"}},0]
["Upgrading Informal Settlements- CAPITAL",null,null,null,null,null,1000000,0,{"$f":"G107-H107","v":1000000},{"$f":"IF(I107=0,\"\",I107/H107)","v":{"$error":"#DIV/0!"}},{"$f":"E107","v":0}]
["Informal Economy Instructure Development",null,66415.360000000001,1000000,1013582.78,null,0,929117.54833333346,-929117.54833333346,-1,1013582.78]
[null,null,null,null,null,null,null,null,0,""]
[null,null,null,null,null,null,null,null,0,""]
[{"$f":"A56","v":"District Municipality:"},null,{"$f":"SUM(C112:C113)","v":0},0,0,0,0,0,0,"",{"$f":"SUM(K112:K113)","v":0}]
["[insert description]",null,null,null,null,null,null,null,0,""]
[null,null,null,null,null,null,null,null,0,""]
[{"$f":"A59","v":"Other grant providers:"},null,{"$f":"SUM(C115:C120)","v":0},0,0,0,0,0,0,"",{"$f":"SUM(K115:K120)","v":0}]
["[insert description]",null,null,null,null,null,null,null,0,{"$f":"IF(I115=0,\"\",I115/H115)","v":""}]
[]
[]
[]
[]
[null,null,null,null,null,null,null,null,0,""]
["Total Capital Transfers and Grants",5,{"$f":"C70+C81+C111+C114","v":324319270.46999997},{"$f":"D70+D81+D111+D114","v":448700054.94999999},536156203.45000005,456721.50999999978,439404873.98000002,491476519.82916665,-52071645.849166676,-0.10594940703833902,529331602.45000005]
[]
["TOTAL RECEIPTS OF TRANSFERS & GRANTS",5,{"$f":"C67+C121","v":1126070596.46},1286684204.8599999,1382171829.3300002,466209.00999999978,1260421194.6599998,1266990843.5525,-6569648.8925000429,-5.1852378617666135E-3,1375347228.3300002]
[{"$f":"head27a","v":"References"}]
["1. Each grant is listed by name as gazetted together with the name of the transferring department or municipality, donor or other organisation"]
["2. Grant expenditure must be separately listed for each grant received"]
["3. Replacement of RSC levies"]
["4. Housing subsidies for housing where ownership transferred"]
["5. Total recurrent/capital grants and subsidies must reconcile to the 'Financial Performance' Statement"]

{"sheet":"SC7(1)","index":22,"n_rows":106,"n_cols":11,"rows_kept":106,"cut":false,"hidden":false,"merged":[[1,0,2,0],[1,1,2,1],[0,0,0,10]]}
[{"$f":"muni& \" - \"&S71M& \" - \"&Head57","v":"KZN225 Msunduzi - Supporting Table SC7(1) Monthly Budget Statement - transfers and grant expenditure  - M11 May"}]
[{"$f":"desc","v":"Description"},{"$f":"head27","v":"Ref"},{"$f":"Head1","v":"2022/23"},{"$f":"Head2","v":"Budget Year 2023/24"}]
[null,null,{"$f":"Head5","v":"Audited Outcome"},{"$f":"Head6","v":"Original Budget"},{"$f":"Head7","v":"Adjusted Budget"},{"$f":"Head38","v":"Monthly actual"},{"$f":"Head39","v":"YearTD actual"},"YearTD budget",{"$f":"Head41","v":"YTD variance"},{"$f":"Head41","v":"YTD variance"},{"$f":"Head8","v":"Full Year Forecast"}]
["R thousands",null,null,null,null,null,null,null,null,"%"]
["EXPENDITURE"]
[]
["Operating expenditure of Transfers and Grants"]
[{"$f":"'SC6'!A8","v":"National Government:"},null,{"$f":"SUM(C9:C19)","v":765766721.62},{"$f":"SUM(D9:D19)","v":805981360},{"$f":"SUM(E9:E17)","v":796838701.98000002},1101597.72,791667748.78999996,730435476.81499994,{"$f":"SUM(I9:I19)","v":61232271.975000076},{"$f":"IF(I8=0,\"\",I8/H8)","v":8.382981648426778E-2},{"$f":"SUM(K9:K19)","v":796838701.98000002}]
[{"$f":"'SC6'!A9","v":"Local Government Equitable Share"},null,696056000,767222000,767222000,null,767222000,{"$f":"E9/12*11","v":703286833.33333325},{"$f":"G9-H9","v":63935166.666666746},9.0909090909091037E-2,{"$f":"E9","v":767222000}]
["Finance Management ",null,1950000,1950000,1950000,34466.29,1324077.1000000001,{"$f":"E10/12*11","v":1787500},-463422.89999999991,-0.2592575664335664,{"$f":"E10","v":1950000}]
["Municipal Systems Improvement",null,null,null,null,null,null,null,0,"",0]
["EPWP Incentive",null,5228150.62,4979000,4701000.0000000009,4581.22,3555760.0100000002,{"$f":"E12/12*11","v":4309250.0000000009},-753489.99000000069,-0.17485409061901735,4701000.0000000009]
["Water Services Operating Subsidy ",null,55555264,null,null,null,null,null,0,"",0]
["Public Transport Infrastracture",null,null,null,null,null,null,null,0,"",0]
["Energy Efficiency  and Demand Management",null,null,null,null,null,null,null,0,"",0]
["Municipal Water Infrastructure Grant",null,null,22000000,13944900,159530,13893840,{"$f":"E16/12*11","v":12782825},1111015,8.6914668705861189E-2,13944900]
["Operating costs-MIG",null,6977307,9830360,9020801.9800000004,903020.21,5672071.6799999988,8269068.4816666674,-2596996.8016666686,-0.3140615907855237,9020801.9800000004]
[{"$f":"'SC6'!A23","v":0},null,null,null,null,null,null,null,0,""]
[null,null,null,null,null,null,null,null,0,""]
[{"$f":"'SC6'!A29","v":"Provincial Government:"},null,{"$f":"SUM(C21:C40)","v":35984604.369999997},{"$f":"SUM(D21:D40)","v":32153789.91},49176923.900000118,5961104.8099999996,25705793.98,45078846.908333443,{"$f":"SUM(I21:I40)","v":-19373052.928333439},-0.4297592830563744,{"$f":"SUM(K21:K40)","v":49176923.900000118}]
["Provincial Government:",null,null,null,null,null,null,null,{"$f":"G21-H21","v":0},""]
["Expanded Public Works Grant",null,null,null,null,null,null,null,0,""]
["Sport and Recreation",null,null,null,null,null,null,null,0,""]
["Human Settlements - Title Deeds Restoration ",null,null,null,null,null,null,null,0,""]
["Housing Accreditation-OPERATING",null,null,null,9006589.4700000007,900024.03,4877366.6800000006,{"$f":"E25/12*11","v":8256040.3475000001},-3378673.6674999995,-0.40923657410699199,{"$f":"E25","v":9006589.4700000007}]
["Human Settlements -  Accredited Municipal RO",null,null,null,null,null,null,0,0,"",0]
["Human Settlements -  Housing Development",null,2831371,null,null,null,null,0,0,"",0]
["Arts and Culture- Community Library Services",null,16172386,null,14678177.370000115,1095431.78,13148986.389999999,13454995.922500106,-306009.53250010684,-2.274319028134246E-2,14678177.370000115]
["Arts and Culture- Provincialisation",null,null,null,null,null,null,0,0,"",0]
["Arts and Culture-Museum Subsidies",null,null,13657999.91,null,null,null,0,0,"",0]
["Arts and Culture-Museum Subsidies - Tatham Art Gallery ",null,91266,null,null,26060.16,135984.68,0,135984.68,{"$error":"#DIV/0!"},0]
["COGTA",null,null,151000,null,null,null,0,0,"",0]
["Municipal Employment Initiative - OPERATING",null,null,null,1099830,2650001.0099999998,2890001.0199999996,1008177.5,1881823.5199999996,1.8665597278257049,1099830]
["Housing Projects -OPERATING",null,2050695,18344790,21134205.060000002,0,1181354,19373021.305,-18191667.305,-0.93902066273498064,21134205.060000002]
["Informal Economy Instructure Development",null,null,null,null,null,null,0,0,"",0]
[{"$f":"'SC6'!A54","v":0},null,null,null,null,null,null,0,0,"",0]
[{"$f":"'SC6'!A55","v":"Other transfers and grants [insert description]"},null,null,null,null,null,null,0,0,"",0]
["Greater Edendale Development Iniatative",null,14670904.369999999,null,3049427,456805.22,1843479.43,2795308.083333333,{"$f":"G38-H38","v":-951828.65333333309},{"$f":"IF(I38=0,\"\",I38/H38)","v":-0.34050939107874717},3049427]
["SETA- Bursaries for Non Employees- OPERATING",null,167982,null,208695,832782.61,1628621.78,191303.75,1437318.03,7.5132768176264193,208695]
[null,null,null,null,null,null,null,null,{"$f":"G40-H40","v":0},{"$f":"IF(I40=0,\"\",I40/H40)","v":""},0]
[{"$f":"'SC6'!A56","v":"District Municipality:"},null,{"$f":"SUM(C42:C43)","v":0},0,{"$f":"SUM(E42:E43)","v":0},0,0,0,0,"",{"$f":"SUM(K42:K43)","v":0}]
[null,null,null,null,null,null,null,null,0,""]
[{"$f":"'SC6'!A57","v":"[insert description]"},null,null,null,null,null,null,null,0,""]
[{"$f":"'SC6'!A59","v":"Other grant providers:"},null,{"$f":"SUM(C45:C46)","v":0},0,0,0,0,0,0,"",{"$f":"SUM(K45:K46)","v":0}]
[null,null,null,null,null,null,null,null,0,""]
[{"$f":"'SC6'!A60","v":"[insert description]"},null,null,null,null,null,null,null,0,""]
["Total operating expenditure of Transfers and Grants:",null,{"$f":"C8+C20+C41+C44","v":801751325.99000001},838135149.90999997,846015625.88000011,7062702.5299999993,817373542.76999998,{"$f":"H8+H20+H41+H44","v":775514323.72333336},41859219.046666637,5.3976074672219744E-2,{"$f":"K8+K20+K41+K44","v":846015625.88000011}]
[]
["Capital expenditure of Transfers and Grants"]
[{"$f":"'SC6'!A70","v":"National Government:"},null,{"$f":"SUM(C51:C61)","v":286472367.39999998},312534640,296019602,13080649.949999999,214201002.46999997,271351301.83333331,-57150299.363333352,{"$f":"IF(I50=0,\"\",I50/H50)","v":-0.21061369146640629},296019602]
[" Municipal Infrastructure Grant (MIG)",null,220148988.53999996,238928640,224358502,6299951.8899999997,172601444.05999997,{"$f":"E51/12*11","v":205661960.16666666},{"$f":"G51-H51","v":-33060516.106666684},-0.16075173104386795,{"$f":"E51","v":224358502}]
[" Public Transport and Systems",null,null,null,null,null,null,0,0,"",0]
["Neighbourhood Development Partnership",null,34499416.369999997,33606000,23606000,5405550.5699999994,9342741.5,21638833.333333336,-12296091.833333336,-0.56824190306008493,23606000]
["Dept of Mineral/Electricty",null,null,null,null,null,null,0,0,"",0]
["Intergrated National Electrification Porgramme",null,27379642.989999998,7000000,7000000,1272252.6300000001,8817625.129999999,6416666.666666667,2400958.463333332,0.37417534493506471,7000000]
["Municipal Systems Improvement",null,null,null,null,null,null,0,0,"",0]
["Water Services Infrastructure Grant ",null,4444319.5,28000000,36055100,179998,18983434.75,33050508.333333332,-14067073.583333332,-0.42562351663274972,36055100]
["Energy Efficiency and Demand Manaagement",null,null,5000000,5000000,-77103.14,4455757.0299999993,4583333.333333334,-127576.30333333462,-2.7834829818182097E-2,5000000]
["  Other capital transfers/grants [insert desc]",null,null,null,null,null,null,0,0,"",0]
[{"$f":"'SC6'!A79","v":"  Other capital transfers/grants [insert desc]"},null,null,null,null,null,null,null,0,""]
[{"$f":"'SC6'!A80","v":0},null,null,null,null,null,null,null,0,""]
[{"$f":"'SC6'!A81","v":"Provincial Government:"},null,{"$f":"SUM(C63:C96)","v":37846903.07},{"$f":"SUM(D63:D96)","v":136165414.94999999},240136601.44999999,20414637.93,151641652.72999999,220125217.99583334,-68483565.265833348,-0.31111185664847196,{"$f":"SUM(K63:K96)","v":233312000.44999999}]
["Airport Development Project",null,null,null,null,null,null,null,0,""]
["Sport and Recreation",null,null,null,null,null,null,null,0,""]
["KZNPA",null,null,null,null,null,null,null,0,""]
["Economic development tourism",null,null,null,null,null,null,null,0,""]
["Capital Provincial KZN Treausry",null,null,null,null,null,null,null,0,""]
["KZN-Military Veterans",null,null,null,6824601,726680.41,2106036.7600000002,{"$f":"E68/12*11","v":6255884.25},-4149847.4899999998,-0.66335106663778187]
["Airport Grant",null,null,null,null,null,null,null,0,""]
["Arts and Culture-Museum Subsidies",null,null,null,null,null,null,null,0,""]
["COGTA",null,null,null,null,null,null,null,0,""]
["Human Settlement",null,null,null,null,null,null,null,0,""]
["Human Settlement - Housing Accreditation",null,417555,700000,700000,7900,357396.74,{"$f":"E73/12*11","v":641666.66666666674},-284269.92666666675,-0.44301806753246764,{"$f":"E73","v":700000}]
["Housing  ",null,null,null,null,null,null,{"$f":"E74/12*11","v":0},0,"",0]
["Provincial Government:",null,null,null,null,null,null,0,0,"",0]
["Arts and Culture- Community Library Services",null,null,420000,null,5730080.9100000001,6120239.25,0,6120239.25,{"$error":"#DIV/0!"},0]
["Arts and Culture-Museum Subsidies - Tatham Art Gallery ",null,347778.71,null,1283206,null,33778.89,1176272.1666666665,-1142493.2766666666,-0.97128310015553376,1283206]
["PMB Airport- CAPITAL",null,2874671,3000000,3274159,null,797183.1,3001312.4166666665,-2204129.3166666664,-0.73438849765417902,3274159]
["Housing Projects -Capital",null,null,14850000,116195414.95,7831891.0199999996,58733401.079999998,106512463.70416667,-47779062.624166667,-0.44857719897335918,116195414.95]
["Human Settlement",null,5021543,116195414.95,null,null,null,0,0,"",0]
["Informal Economy Instructure Development",null,null,1000000,1013582.78,null,null,929117.54833333346,-929117.54833333346,-1,1013582.78]
[null,null,null,null,null,null,null,0,null,null,0]
[null,null,null,null,null,null,null,0,null,null,0]
[null,null,null,null,null,null,null,0,null,null,0]
[null,null,null,null,null,null,null,0,null,null,0]
[null,null,null,null,null,null,null,0,null,null,0]
[null,null,null,null,null,null,null,0,null,null,0]
[{"$f":"'SC6'!A110","v":0},null,null,null,null,null,null,0,0,"",0]
["Greater Edendale Development Iniatative-CAPITAL",null,11683354,null,85458849.140000001,83347,77375828.320000008,78337278.37833333,{"$f":"G89-H89","v":-961450.05833332241},{"$f":"IF(I89=0,\"\",I89/H89)","v":-1.2273212424995888E-2},85458849.140000001]
["Municipal Disaster Response Grant",null,620000,null,null,6034738.5899999999,6117788.5899999999,null,{"$f":"G90-H90","v":6117788.5899999999},{"$f":"IF(I90=0,\"\",I90/H90)","v":{"$error":"#DIV/0!"}},0]
["Corridor Development",null,487435,null,null,null,null,null,0,"",0]
["Operation Dlulisumlando-Capital",null,null,null,null,null,null,null,0,"",0]
["Informal Economy Instructure Development",null,66415.360000000001,null,null,null,0,null,0,"",0]
["Youth Enterprise Park-CAPITAL",null,197683,null,null,null,null,null,0,"",0]
["Jika Joe Community Residential Units-CAPITAL",null,null,null,25386788.579999998,null,0,{"$f":"E95/12*11","v":23271222.864999998},-23271222.864999998,-1,25386788.579999998]
["Eastwood Primary Substation-CAPITAL",null,16130468,null,null,null,0,null,{"$f":"G96-H96","v":0},{"$f":"IF(I96=0,\"\",I96/H96)","v":""},0]
[{"$f":"'SC6'!A111","v":"District Municipality:"},null,{"$f":"SUM(C98:C99)","v":0},0,0,0,0,0,0,"",{"$f":"SUM(K98:K99)","v":0}]
[null,null,null,null,null,null,null,null,0,""]
[{"$f":"'SC6'!A113","v":0},null,null,null,null,null,null,null,0,""]
[{"$f":"'SC6'!A114","v":"Other grant providers:"},null,{"$f":"SUM(C101:C102)","v":0},0,0,0,0,0,0,"",{"$f":"SUM(K101:K102)","v":0}]
[null,null,null,null,null,null,null,null,0,""]
[{"$f":"'SC6'!A120","v":0},null,null,null,null,null,null,null,0,""]
["Total capital expenditure of Transfers and Grants",null,{"$f":"C50+C62+C97+C100","v":324319270.46999997},{"$f":"D50+D62+D97+D100","v":448700054.94999999},536156203.44999999,33495287.879999999,365842655.19999993,491476519.82916665,-125633864.62916669,{"$f":"IF(I103=0,\"\",I103/H103)","v":-0.25562536471291858},529331602.44999999]
[]
["TOTAL EXPENDITURE OF TRANSFERS AND GRANTS",null,{"$f":"C47+C103","v":1126070596.46},1286835204.8599999,1382171829.3300002,40557990.409999996,1183216197.9699998,1266990843.5525,-83774645.582500055,{"$f":"IF(I105=0,\"\",I105/H105)","v":-6.6120955813386437E-2},1375347228.3300002]
[{"$f":"head27a","v":"References"}]

{"sheet":"SC7(2)","index":23,"n_rows":50,"n_cols":7,"rows_kept":50,"cut":false,"hidden":false,"merged":[[0,0,0,6],[1,0,2,0],[1,1,2,1],[1,2,1,6]]}
[{"$f":"muni& \" - \"&S71T& \" - \"&Head57","v":"KZN225 Msunduzi - Supporting Table SC7(2) Monthly Budget Statement - Expenditure against approved rollovers - M11 May"}]
[{"$f":"desc","v":"Description"},{"$f":"head27","v":"Ref"},{"$f":"Head2","v":"Budget Year 2023/24"}]
[null,null,{"$f":"\"Approved Rollover \" &Head1","v":"Approved Rollover 2022/23"},{"$f":"Head38","v":"Monthly actual"},{"$f":"Head39","v":"YearTD actual"},{"$f":"Head41","v":"YTD variance"},{"$f":"Head41","v":"YTD variance"}]
["R thousands",null,null,null,null,null,"%"]
["EXPENDITURE"]
[]
["Operating expenditure of Approved Roll-overs"]
[{"$f":"'SC6'!A8","v":"National Government:"},null,{"$f":"SUM(C9:C15)","v":0},{"$f":"SUM(D9:D15)","v":0},{"$f":"SUM(E9:E15)","v":0},{"$f":"C8-E8","v":0},{"$f":"IF(F8=0,\"\",F8/C8)","v":""}]
[{"$f":"'SC6'!A9","v":"Local Government Equitable Share"},null,null,null,null,{"$f":"C9-E9","v":0},{"$f":"IF(F9=0,\"\",F9/C9)","v":""}]
[{"$f":"'SC6'!A10","v":"Finance Management "},null,null,null,null,{"$f":"C10-E10","v":0},""]
[{"$f":"'SC6'!A20","v":0},null,null,null,null,0,""]
[{"$f":"'SC6'!A21","v":0},null,null,null,null,0,""]
[{"$f":"'SC6'!A22","v":0},null,null,null,null,0,""]
[{"$f":"'SC6'!A23","v":0},null,null,null,null,0,""]
[{"$f":"'SC6'!A28","v":"Other transfers and grants [insert description]"},null,null,null,null,0,""]
[{"$f":"'SC6'!A29","v":"Provincial Government:"},null,{"$f":"SUM(C17:C21)","v":0},{"$f":"SUM(D17:D21)","v":0},{"$f":"SUM(E17:E21)","v":0},{"$f":"C16-E16","v":0},""]
[{"$f":"'SC6'!A30","v":"Provincial Government:"},null,null,null,null,0,""]
[{"$f":"'SC6'!A52","v":0},null,null,null,null,0,""]
[{"$f":"'SC6'!A53","v":0},null,null,null,null,0,""]
[{"$f":"'SC6'!A54","v":0},null,null,null,null,0,""]
[{"$f":"'SC6'!A55","v":"Other transfers and grants [insert description]"},null,null,null,null,0,""]
[{"$f":"'SC6'!A56","v":"District Municipality:"},null,{"$f":"SUM(C23:C24)","v":0},{"$f":"SUM(D23:D24)","v":0},{"$f":"SUM(E23:E24)","v":0},0,""]
[null,null,null,null,null,0,""]
[{"$f":"'SC6'!A57","v":"[insert description]"},null,null,null,null,0,""]
[{"$f":"'SC6'!A59","v":"Other grant providers:"},null,{"$f":"SUM(C26:C27)","v":0},{"$f":"SUM(D26:D27)","v":0},{"$f":"SUM(E26:E27)","v":0},0,""]
[null,null,null,null,null,0,""]
[{"$f":"'SC6'!A60","v":"[insert description]"},null,null,null,null,0,""]
["Total operating expenditure of Approved Roll-overs",null,{"$f":"C8+C16+C22+C25","v":0},{"$f":"D8+D16+D22+D25","v":0},{"$f":"E8+E16+E22+E25","v":0},{"$f":"F8+F16+F22+F25","v":0},""]
[null,null,null,null,null,null,""]
["Capital expenditure of Approved Roll-overs",null,null,null,null,null,""]
[{"$f":"'SC6'!A70","v":"National Government:"},null,{"$f":"SUM(C32:C37)","v":0},{"$f":"SUM(D32:D37)","v":0},{"$f":"SUM(E32:E37)","v":0},{"$f":"SUM(F32:F37)","v":0},""]
[{"$f":"'SC6'!A71","v":" Municipal Infrastructure Grant (MIG)"},null,null,null,null,{"$f":"C32-E32","v":0},""]
[{"$f":"'SC6'!A76","v":"Municipal Systems Improvement"},null,null,null,null,0,""]
[{"$f":"'SC6'!A77","v":"Water Services Infrastructure Grant "},null,null,null,null,0,""]
[{"$f":"'SC6'!A78","v":"Energy Efficiency and Demand Manaagement"},null,null,null,null,0,""]
[{"$f":"'SC6'!A79","v":"  Other capital transfers/grants [insert desc]"},null,null,null,null,0,""]
[{"$f":"'SC6'!A80","v":0},null,null,null,null,0,""]
[{"$f":"'SC6'!A81","v":"Provincial Government:"},null,{"$f":"SUM(C39:C40)","v":0},{"$f":"SUM(D39:D40)","v":0},{"$f":"SUM(E39:E40)","v":0},0,""]
[null,null,null,null,null,{"$f":"C39-E39","v":0},""]
[{"$f":"'SC6'!A110","v":0},null,null,null,null,0,""]
[{"$f":"'SC6'!A111","v":"District Municipality:"},null,{"$f":"SUM(C42:C43)","v":0},{"$f":"SUM(D42:D43)","v":0},{"$f":"SUM(E42:E43)","v":0},0,""]
[null,null,null,null,null,0,""]
[{"$f":"'SC6'!A113","v":0},null,null,null,null,0,""]
[{"$f":"'SC6'!A114","v":"Other grant providers:"},null,{"$f":"SUM(C45:C46)","v":0},{"$f":"SUM(D45:D46)","v":0},{"$f":"SUM(E45:E46)","v":0},0,""]
[null,null,null,null,null,0,""]
[{"$f":"'SC6'!A120","v":0},null,null,null,null,0,""]
["Total capital expenditure of Approved Roll-overs",null,{"$f":"C31+C38+C41+C44","v":0},{"$f":"D31+D38+D41+D44","v":0},{"$f":"E31+E38+E41+E44","v":0},{"$f":"F31+F38+F41+F44","v":0},""]
[]
["TOTAL EXPENDITURE OF APPROVED ROLL-OVERS",null,{"$f":"C28+C47","v":0},{"$f":"D28+D47","v":0},{"$f":"E28+E47","v":0},{"$f":"F28+F47","v":0},""]
[{"$f":"head27a","v":"References"}]

{"sheet":"SC8","index":24,"n_rows":134,"n_cols":11,"rows_kept":134,"cut":false,"hidden":false,"merged":[[1,0,2,0],[1,1,2,1],[0,0,0,10]]}
[{"$f":"muni& \" - \"&S71N& \" - \"&Head57","v":"KZN225 Msunduzi - Supporting Table SC8 Monthly Budget Statement - councillor and staff benefits  - M11 May"}]
["Summary of Employee and Councillor remuneration",{"$f":"head27","v":"Ref"},{"$f":"Head1","v":"2022/23"},{"$f":"Head2","v":"Budget Year 2023/24"}]
[null,null,{"$f":"Head5","v":"Audited Outcome"},{"$f":"Head6","v":"Original Budget"},{"$f":"Head7","v":"Adjusted Budget"},{"$f":"Head38","v":"Monthly actual"},{"$f":"Head39","v":"YearTD actual"},"YearTD budget",{"$f":"Head41","v":"YTD variance"},{"$f":"Head41","v":"YTD variance"},{"$f":"Head8","v":"Full Year Forecast"}]
["R thousands",null,null,null,null,null,null,null,null,"%"]
[null,1,"A","B","C",null,null,null,null,null,"D"]
["Councillors (Political Office Bearers plus Other)"]
["Basic Salaries and Wages",null,41149541.75,3617588.3640500004,3617588.3640500004,3711064.15,46820607.840000004,{"$f":"E7/12*11","v":3316122.667045834},{"$f":"G7-H7","v":43504485.172954172},{"$f":"IF(I7=0,\"\",I7/H7)","v":13.119081994548205},{"$f":"E7","v":3617588.3640500004}]
["Pension and UIF Contributions",null,2495026.4299999997,3295202.9094000002,3295202.9094000002,258212.78,3110974.3200000003,{"$f":"E8/12*11","v":3020602.6669500005},90371.653049999848,2.9918417949769942E-2,{"$f":"E8","v":3295202.9094000002}]
["Medical Aid Contributions",null,1822146.0400000003,8000704.2033999991,8000704.2033999991,175719.48,1907700.0100000002,7333978.853116665,-5426278.8431166653,-0.73988198654413917,8000704.2033999991]
["Motor Vehicle Allowance",null,2551435.1199999996,39272669.756449997,39272669.756449997,235405.43,2636518.79,35999947.276745826,{"$f":"G10-H10","v":-33363428.486745827},{"$f":"IF(I10=0,\"\",I10/H10)","v":-0.92676325968668682},39272669.756449997]
["Cellphone Allowance",null,3718742.12,746801.93215000001,746801.93215000001,330360,3926261,684568.43780416669,{"$f":"G11-H11","v":3241692.5621958333},{"$f":"IF(I11=0,\"\",I11/H11)","v":4.7353812755287716},746801.93215000001]
["Housing Allowances",null,80615.390000000014,7766967.8245499991,7766967.8245499991,7449.54,90723.91,7119720.5058374992,{"$f":"G12-H12","v":-7028996.595837499},{"$f":"IF(I12=0,\"\",I12/H12)","v":-0.98725737759991916},7766967.8245499991]
["Other benefits and allowances",null,-3.637978807091713E-12,null,null,1614.38,46603.77,0,46603.77,{"$error":"#DIV/0!"},0]
["Sub Total - Councillors",null,{"$f":"SUM(C7:C13)","v":51817506.849999994},62699934.989999995,62699934.989999995,4719825.76,58539389.640000001,57474940.407499991,1064449.2325000092,1.8520232034222477E-2,62699934.989999995]
["% increase",4,null,{"$f":"IF(D14=0,\"\",(D14/C14)-1)","v":0.21001450670913546},{"$f":"IF(E14=0,\"\",(E14/C14)-1)","v":0.21001450670913546},null,null,null,null,null,{"$f":"IF(K14=0,\"\",(K14/C14)-1)","v":0.21001450670913546}]
[]
["Senior Managers of the Municipality",3]
["Basic Salaries and Wages",null,8621181.0399999991,8726581.2023999989,8221518.0799999991,493627.13,6338014.4399999995,{"$f":"E18/12*11","v":7536391.5733333323},{"$f":"G18-H18","v":-1198377.1333333328},{"$f":"IF(I18=0,\"\",I18/H18)","v":-0.15901205791557521},{"$f":"E18","v":8221518.0799999991}]
["Pension and UIF Contributions",null,815554.81999999983,686804.61239999952,959316.2699999999,81641.299999999988,922489.69000000006,879373.24749999994,43116.442500000121,4.9030878097073474E-2,959316.2699999999]
["Medical Aid Contributions",null,198504,60106363.232699998,239898.03000000119,14219.18,156159.85999999999,219906.5275000011,-63746.667500001116,-0.2898807426259814,239898.03000000119]
["Overtime",null,0,0,0,null,null,null,0,""]
["Performance Bonus",null,null,0,null,null,null,null,{"$f":"G22-H22","v":0},{"$f":"IF(I22=0,\"\",I22/H22)","v":""}]
["Motor Vehicle Allowance",null,993254.84999999986,2558774.6658000001,788158.51,71713.7,823939.92,{"$f":"E23/12*11","v":722478.63416666677},{"$f":"G23-H23","v":101461.28583333327},{"$f":"IF(I23=0,\"\",I23/H23)","v":0.1404349984001429},{"$f":"E23","v":788158.51}]
["Cellphone Allowance",null,110200,170918.655,105411,7950,100930.41,96626.75,{"$f":"G24-H24","v":4303.6600000000035},{"$f":"IF(I24=0,\"\",I24/H24)","v":4.4539012230050204E-2},105411]
["Housing Allowances",null,202668.99,70026008.514099985,211648.92000000179,17236.16,189597.76,194011.51000000164,{"$f":"G25-H25","v":-4413.7500000016298},{"$f":"IF(I25=0,\"\",I25/H25)","v":-2.2749938908271952E-2},211648.92000000179]
["Other benefits and allowances",null,122249.09000000001,null,null,29641.52,54997.520000000004,null,54997.520000000004,{"$error":"#DIV/0!"}]
["Payments in lieu of leave",null,null,null,null,null,null,null,0,""]
["Long service awards",null,null,null,null,null,null,null,0,""]
["Post-retirement benefit obligations",2,null,null,null,null,null,null,0,""]
["Entertainment"]
["Scarcity"]
["Acting and post related allowance"]
["In kind benefits"]
["Sub Total - Senior Managers of Municipality",null,{"$f":"SUM(C18:C33)","v":11063612.789999999},{"$f":"SUM(D18:D33)","v":142275450.88239998},10525950.810000002,716028.99,8586129.5999999996,9648788.2425000034,-1062658.6425000038,{"$f":"IF(I34=0,\"\",I34/H34)","v":-0.11013389617354362},{"$f":"SUM(K18:K33)","v":10525950.810000002}]
["% increase",4,null,{"$f":"IF(D34=0,\"\",(D34/C34)-1)","v":11.859764127952637},{"$f":"IF(E34=0,\"\",(E34/C34)-1)","v":-4.8597324418834464E-2},null,null,null,null,null,{"$f":"IF(K34=0,\"\",(K34/C34)-1)","v":-4.8597324418834464E-2}]
[]
["Other Municipal Staff"]
["Basic Salaries and Wages",null,991780147.24000001,1019072091.7335999,1224531687.4399974,80272805.559999973,888180641.48000026,{"$f":"E38/12*11","v":1122487380.153331},{"$f":"G38-H38","v":-234306738.67333078},{"$f":"IF(I38=0,\"\",I38/H38)","v":-0.20873886229466976},{"$f":"E38","v":1224531687.4399974}]
["Pension and UIF Contributions",null,180565597.98999989,291354033.96719986,163807449.46999991,15486623.329999998,171842572.53000006,150156828.68083325,21685743.849166811,0.14442063034816136,163807449.46999991]
["Medical Aid Contributions",null,63939025.219999984,122280401.89004992,87657511.089999974,6875187.4299999978,72750395.269999996,80352718.499166653,-7602323.2291666567,-9.4611898280025225E-2,87657511.089999974]
["Overtime",null,120002832.08999999,101319919.92825001,110905901.66999999,10665565.99,113107417.33999997,101663743.19749998,11443674.142499998,0.11256396609623764,110905901.66999999]
["Performance Bonus",null,null,null,null,92548.24,73937591.76000002,{"$f":"E42/12*11","v":0},73937591.76000002,{"$error":"#DIV/0!"}]
["Motor Vehicle Allowance",null,30212240.010000002,36571760.256699994,50998717.310000032,2634018.75,29399072.330000009,{"$f":"E43/12*11","v":46748824.200833365},{"$f":"G43-H43","v":-17349751.870833356},{"$f":"IF(I43=0,\"\",I43/H43)","v":-0.37112702121231256},50998717.310000032]
["Cellphone Allowance",null,4908050.16,5140755.628349999,5940432.4900000012,457420.41,4953473.1899999995,5445396.4491666676,{"$f":"G44-H44","v":-491923.25916666817},{"$f":"IF(I44=0,\"\",I44/H44)","v":-9.0337455455965804E-2},5940432.4900000012]
["Housing Allowances",null,4538421.8999999994,4915659.4435500009,6121286.9699999904,390196.76999999996,4331621.6399999997,5611179.7224999908,{"$f":"G45-H45","v":-1279558.0824999912},{"$f":"IF(I45=0,\"\",I45/H45)","v":-0.22803726591917112},6121286.9699999904]
["Other benefits and allowances",null,34345392.159999989,39950483.127450019,19113720.91,4641359.1500000004,29004004.039999999,17520910.834166668,11483093.205833331,0.6553936216284324,19113720.91]
["Payments in lieu of leave",null,0,0,0,0,0,0,0,""]
["Long service awards",null,25500536.440000009,18329951.142449994,25261996.479999997,1924027.6599999992,26822639.59999999,23156830.106666662,3665809.4933333285,0.15830359666878466,25261996.479999997]
["Post-retirement benefit obligations",2,0,0,null,null,null,{"$f":"E49/12*11","v":0},0,""]
["Entertainment",null,null,null,null,null,null,null,0,""]
["Scarcity",null,null,null,null,null,null,null,0,""]
["Acting and post related allowance",null,null,null,null,null,null,null,0,""]
["In kind benefits",null,null,null,null,null,null,null,0,""]
["Sub Total - Other Municipal Staff",null,{"$f":"SUM(C38:C53)","v":1455792243.2100003},1638935057.1176,1694338703.8299975,123439753.28999995,1414329429.1800003,1553143811.8441646,-138814382.6641643,{"$f":"IF(I54=0,\"\",I54/H54)","v":-8.9376387173921476E-2},{"$f":"SUM(K38:K53)","v":1694338703.8299975}]
["% increase",4,null,{"$f":"IF(D54=0,\"\",(D54/C54)-1)","v":0.12580285048350892},{"$f":"IF(E54=0,\"\",(E54/C54)-1)","v":0.16386023605539068},null,null,null,null,null,{"$f":"IF(K54=0,\"\",(K54/C54)-1)","v":0.16386023605539068}]
["Total Parent Municipality",null,{"$f":"C14+C34+C54","v":1518673362.8500004},1843910442.99,1767564589.6299975,128875608.03999995,1481454948.4200003,1620267540.4941647,{"$f":"G56-H56","v":-138812592.07416439},{"$f":"IF(I56=0,\"\",I56/H56)","v":-8.5672636527562601E-2},{"$f":"K14+K34+K54","v":1767564589.6299975}]
[null,null,null,{"$f":"IF(D56=0,\"\",(D56/C56)-1)","v":0.2141586782885605},{"$f":"IF(E56=0,\"\",(E56/C56)-1)","v":0.163887266918884},null,null,null,null,null,{"$f":"IF(K56=0,\"\",(K56/C56)-1)","v":0.163887266918884}]
["Unpaid salary, allowances & benefits in arrears:"]
[]
["Board Members of Entities"]
["Basic Salaries and Wages",null,null,230780,230780,0,197818.25,{"$f":"E61/12*11","v":211548.33333333334},{"$f":"G61-H61","v":-13730.083333333343},{"$f":"IF(I61=0,\"\",I61/H61)","v":-6.4902819686596488E-2},{"$f":"E61","v":230780}]
["Pension and UIF Contributions",null,null,null,null,null,null,null,0,""]
["Medical Aid Contributions",null,null,null,null,null,null,null,0,""]
["Overtime",null,null,null,null,null,null,null,0,{"$f":"IF(I64=0,\"\",I64/H64)","v":""}]
["Performance Bonus",null,null,null,null,null,null,null,0,{"$f":"IF(I65=0,\"\",I65/H65)","v":""}]
["Motor Vehicle Allowance",null,null,null,null,null,null,null,0,{"$f":"IF(I66=0,\"\",I66/H66)","v":""}]
["Cellphone Allowance",null,null,null,null,null,null,null,0,{"$f":"IF(I67=0,\"\",I67/H67)","v":""}]
["Housing Allowances",null,null,null,null,null,null,null,0,{"$f":"IF(I68=0,\"\",I68/H68)","v":""}]
["Other benefits and allowances",null,null,null,null,null,null,null,0,""]
["Board Fees",5,null,null,null,null,null,null,0,{"$f":"IF(I70=0,\"\",I70/H70)","v":""}]
["Payments in lieu of leave",null,null,null,null,null,null,null,0,""]
["Long service awards",null,null,null,null,null,null,null,0,""]
["Post-retirement benefit obligations",null,null,null,null,null,null,null,0,""]
["Entertainment"]
["Scarcity"]
["Acting and post related allowance"]
["In kind benefits"]
["Sub Total - Executive members Board",2,{"$f":"SUM(C61:C77)","v":0},230780,230780,0,197818.25,211548.33333333334,{"$f":"G78-H78","v":-13730.083333333343},{"$f":"IF(I78=0,\"\",I78/H78)","v":-6.4902819686596488E-2},{"$f":"SUM(K61:K77)","v":230780}]
["% increase",4,null,{"$f":"IF(D78=0,\"\",(D78/C78)-1)","v":{"$error":"#DIV/0!"}},{"$f":"IF(E78=0,\"\",(E78/C78)-1)","v":{"$error":"#DIV/0!"}},null,null,null,null,null,{"$f":"IF(K78=0,\"\",(K78/C78)-1)","v":{"$error":"#DIV/0!"}}]
[]
["Senior Managers of Entities"]
["Basic Salaries and Wages",null,null,857644,857644,61873.79,742308.36,{"$f":"E82/12*11","v":786173.66666666663},{"$f":"G82-H82","v":-43865.306666666642},{"$f":"IF(I82=0,\"\",I82/H82)","v":-5.579595008906002E-2},{"$f":"E82","v":857644}]
["Pension and UIF Contributions",null,null,null,null,null,null,0,0,""]
["Medical Aid Contributions",null,null,30923,30923,3085.68,32115.360000000001,28346.083333333332,3769.2766666666685,0.13297345606241903,{"$f":"E84","v":30923}]
["Overtime",null,null,30000,30000,null,null,27500,-27500,-1,30000]
["Performance Bonus",null,null,null,null,null,null,0,{"$f":"G86-H86","v":0},{"$f":"IF(I86=0,\"\",I86/H86)","v":""}]
["Motor Vehicle Allowance",null,null,null,null,2500,27500,0,{"$f":"G87-H87","v":27500},{"$f":"IF(I87=0,\"\",I87/H87)","v":{"$error":"#DIV/0!"}}]
["Cellphone Allowance",null,null,10800,10800,900,9900,9900,{"$f":"G88-H88","v":0},{"$f":"IF(I88=0,\"\",I88/H88)","v":""},{"$f":"E88","v":10800}]
["Housing Allowances",null,null,null,null,null,null,null,{"$f":"G89-H89","v":0},{"$f":"IF(I89=0,\"\",I89/H89)","v":""}]
["Other benefits and allowances",null,null,null,null,null,null,null,0,""]
["Payments in lieu of leave",null,null,null,null,null,null,null,0,""]
["Long service awards",null,null,null,null,null,null,null,0,""]
["Post-retirement benefit obligations",2,null,null,null,null,null,null,0,""]
["Entertainment"]
["Scarcity"]
["Acting and post related allowance"]
["In kind benefits"]
["Sub Total - Senior Managers of Entities",null,{"$f":"SUM(C82:C97)","v":0},929367,929367,68359.47,811823.72,851919.75,-40096.030000000028,{"$f":"IF(I98=0,\"\",I98/H98)","v":-4.7065501181302614E-2},{"$f":"SUM(K82:K97)","v":929367}]
["% increase",4,null,{"$f":"IF(D98=0,\"\",(D98/C98)-1)","v":{"$error":"#DIV/0!"}},{"$f":"IF(E98=0,\"\",(E98/C98)-1)","v":{"$error":"#DIV/0!"}},null,null,null,null,null,{"$f":"IF(K98=0,\"\",(K98/C98)-1)","v":{"$error":"#DIV/0!"}}]
[]
["Other Staff of Entities"]
["Basic Salaries and Wages",null,null,8736818,8736818,655462.28,7792167.5800000001,{"$f":"E102/12*11","v":8008749.833333333},{"$f":"G102-H102","v":-216582.25333333295},{"$f":"IF(I102=0,\"\",I102/H102)","v":-2.7043203725991394E-2},{"$f":"E102","v":8736818}]
["Pension and UIF Contributions",null,null,600000,600000,47570.36,518326.54,550000,-31673.460000000021,-5.7588109090909126E-2,600000]
["Medical Aid Contributions",null,null,865532,865532,103946.04,1072413.48,793404.33333333337,{"$f":"G104-H104","v":279009.14666666661},{"$f":"IF(I104=0,\"\",I104/H104)","v":0.35166072952294597},865532]
["Overtime",null,null,367150,367150,39485.760000000002,339687.46,336554.16666666663,{"$f":"G105-H105","v":3133.2933333333931},{"$f":"IF(I105=0,\"\",I105/H105)","v":9.3099228702662323E-3},367150]
["Performance Bonus",null,null,null,null,null,null,0,{"$f":"G106-H106","v":0},{"$f":"IF(I106=0,\"\",I106/H106)","v":""}]
["Motor Vehicle Allowance",null,null,102000,102000,8500,93500,93500,{"$f":"G107-H107","v":0},{"$f":"IF(I107=0,\"\",I107/H107)","v":""},{"$f":"E107","v":102000}]
["Cellphone Allowance",null,null,106200,106200,8850,97350,97350,0,"",106200]
["Housing Allowances",null,null,null,null,null,null,null,0,""]
["Other benefits and allowances",null,null,null,null,52938.7,52938.7,null,52938.7,{"$error":"#DIV/0!"}]
["Payments in lieu of leave",null,null,null,null,null,null,null,0,""]
["Long service awards",null,null,null,null,null,null,null,0,""]
["Post-retirement benefit obligations",null,null,null,null,null,null,null,0,""]
["Entertainment"]
["Scarcity"]
["Acting and post related allowance"]
["In kind benefits"]
["Sub Total - Other Staff of Entities",null,{"$f":"SUM(C102:C117)","v":0},10777700,10777700,916753.14,9966383.7599999998,9879558.3333333321,86825.426666667685,{"$f":"IF(I118=0,\"\",I118/H118)","v":8.7883915188517389E-3},{"$f":"SUM(K102:K117)","v":10777700}]
["% increase",4,null,{"$f":"IF(D118=0,\"\",(D118/C118)-1)","v":{"$error":"#DIV/0!"}},{"$f":"IF(E118=0,\"\",(E118/C118)-1)","v":{"$error":"#DIV/0!"}},null,null,null,null,null,{"$f":"IF(K118=0,\"\",(K118/C118)-1)","v":{"$error":"#DIV/0!"}}]
["Total Municipal Entities",null,{"$f":"C78+C98+C118","v":0},11937847,11937847,985112.61,10976025.73,10943026.416666666,{"$f":"G120-H120","v":32999.313333334401},{"$f":"IF(I120=0,\"\",I120/H120)","v":3.0155563988290414E-3},{"$f":"K78+K98+K118","v":11937847}]
["TOTAL SALARY, ALLOWANCES & BENEFITS",null,{"$f":"C56+C120","v":1518673362.8500004},1855848289.99,1779502436.6299975,129860720.64999995,1492430974.1500003,1631210566.9108315,{"$f":"G121-H121","v":-138779592.76083112},{"$f":"IF(I121=0,\"\",I121/H121)","v":-8.5077669048975318E-2},{"$f":"K56+K120","v":1779502436.6299975}]
["% increase",4,null,{"$f":"IF(D121=0,\"\",(D121/C121)-1)","v":0.22201938572705604},{"$f":"IF(E121=0,\"\",(E121/C121)-1)","v":0.17174797435737954},null,null,null,null,null,{"$f":"IF(K121=0,\"\",(K121/C121)-1)","v":0.17174797435737954}]
["TOTAL MANAGERS AND STAFF",null,{"$f":"C34+C54+C98+C118","v":1466855856.0000002},1792917575,1716571721.6399975,{"$f":"F34+F54+F98+F118+F78","v":125140894.88999994},{"$f":"G34+G54+G98+G118+G78","v":1433891584.5100002},1573524078.1699979,-139830311.90999764,{"$f":"IF(I123=0,\"\",I123/H123)","v":-8.8864424669382699E-2},{"$f":"K34+K54+K98+K118","v":1716571721.6399975}]
[{"$f":"head27a","v":"References"}]
["1. Include 'Loans and advances' where applicable if any reportable amounts until phased compliance with s164 of MFMA achieved"]
["2. If benefits in kind are provided (e.g. provision of living quarters) the full market value must be shown as the cost to the municipality"]
["3. s57 of the Systems Act"]
["4. B/A, C/A, D/A"]
["5. Included in Contracted services"]
["Column Definitions:"]
["A. Audited actual 2022/23 (audited financial statements). If audited amounts unavailable, unaudited amounts must be provided with a note stating these are unaudited"]
["B. The original budget approved by council for the 2023/24 budget year."]
["C. The budget for 2023/24 budget year as adjusted by council resolution in terms of section 28 of the MFMA."]
["D. An estimate of final actual amounts (pre audit - 2006/07 budget year) at the time of preparing the budget for the 2007/08 budget year. This may differ from C."]

{"sheet":"SC9","index":25,"n_rows":62,"n_cols":17,"rows_kept":62,"cut":false,"hidden":false,"merged":[[2,15,3,15],[2,16,3,16],[1,0,2,0],[2,14,3,14],[1,1,2,1],[1,2,1,13],[1,14,1,16]]}
[{"$f":"muni& \" - \"&S71O& \" - \"&Head57","v":"KZN225 Msunduzi - Supporting Table SC9 Monthly Budget Statement - actuals and revised targets for cash receipts - M11 May"}]
[{"$f":"desc","v":"Description"},{"$f":"head27","v":"Ref"},{"$f":"Head2","v":"Budget Year 2023/24"},null,null,null,null,null,null,null,null,null,null,null,{"$f":"'Template names'!B5","v":"2023/24 Medium Term Revenue & Expenditure Framework"}]
[null,null,"July","August","Sept","October","Nov","Dec","January","Feb","March","April","May","June",{"$f":"Head9","v":"Budget Year 2023/24"},{"$f":"Head10","v":"Budget Year +1 2024/25"},{"$f":"Head11","v":"Budget Year +2 2025/26"}]
["R thousands",1,"Outcome","Outcome","Outcome","Outcome","Outcome","Outcome","Budget","Budget","Budget","Budget","Budget","Budget"]
["Cash Receipts By Source"]
["Property rates",null,null,null,null,null,null,null,null,null,null,null,null,{"$f":"O6-SUM(C6:M6)","v":1435365977},1435365977,1521716983,1593237681]
["Service charges - Electricity revenue",null,null,null,null,null,null,null,null,null,null,null,null,3386751744,3386751744,4849435829,5722334279]
["Service charges - Water revenue",null,null,null,null,null,null,null,null,null,null,null,null,784367206,784367206,1015651656,1063387284]
["Service charges - Waste Water Management",null,null,null,null,null,null,null,null,null,null,null,null,176174888,176174888,228123149,238844937]
["Service charges - Waste Mangement",null,null,null,null,null,null,null,null,null,null,null,null,120705336,120705336,156297424,163643403]
[null,null,null,null,null,null,null,null,null,null,null,null,null,0]
["Rental of facilities and equipment",null,null,null,null,null,null,null,null,null,null,null,null,104823532,104823532,67574148,70750133]
["Interest earned - external investments",null,null,null,null,null,null,null,null,null,null,null,null,18052025,18052025,19225407,20494284]
["Interest earned - outstanding debtors",null,null,null,null,null,null,null,null,null,null,null,null,0]
["Dividends received",null,null,null,null,null,null,null,null,null,null,null,null,0]
["Fines, penalties and forfeits",null,null,null,null,null,null,null,null,null,null,null,null,8795949,8795949,7620808,7978986]
["Licences and permits",null,null,null,null,null,null,null,null,null,null,null,null,2451744,2451744,2400591,2513419]
["Agency services",null,null,null,null,null,null,null,null,null,null,null,null,714790,714790,749815,785056]
["Transfers and Subsidies - Operational",null,null,null,null,null,null,null,null,null,null,null,null,834106196,834106196,906109405,982491448]
["Other revenue",null,null,null,null,null,null,null,null,null,null,null,null,990078985.42999995,990078985.42999995,152145895.11000001,159291111.52000001]
["Cash Receipts by Source",null,{"$f":"SUM(C6:C10)+SUM(C15:C20)","v":0},0,0,0,0,0,0,0,0,0,0,7739512815.4300003,7739512815.4300003,8840251555.1100006,9934507604.5200005]
["Other Cash Flows by Source",null,null,null,null,null,null,null,null,null,null,null,null,{"$f":"O22-SUM(C22:M22)","v":0}]
["Transfers and subsidies - capital (monetary allocations) (National / Provincial and District)",null,null,null,null,null,null,null,null,null,null,null,null,452578009,452578009,321309343,327881560]
["Transfers and subsidies - capital (monetary allocations) (Nat / Prov Departm Agencies, Households, Non-profit Institutions, Private Enterprises, Public Corporatons, Higher Educ Institutions)",null,null,null,null,null,null,null,null,null,null,null,null,0]
["Proceeds on Disposal of Fixed and Intangible Assets",null,null,null,null,null,null,null,null,null,null,null,null,0]
["Short term loans",null,null,null,null,null,null,null,null,null,null,null,null,0]
["Borrowing long term/refinancing",null,null,null,null,null,null,null,null,null,null,null,null,200000000,200000000,150000000]
["Increase (decrease) in consumer deposits",null,null,null,null,null,null,null,null,null,null,null,null,0]
[]
["Decrease (increase) in non-current receivables",null,null,null,null,null,null,null,null,null,null,null,null,0]
["Decrease (increase) in non-current investments",null,null,null,null,null,null,null,null,null,null,null,null,0]
["Total Cash Receipts by Source",null,{"$f":"SUM(C21:C28)+SUM(C30:C31)","v":0},0,0,0,0,0,0,0,0,0,0,8392090824.4300003,8392090824.4300003,9311560898.1100006,10262389164.52]
["Cash Payments by Type",null,null,null,null,null,null,null,null,null,null,null,null,{"$f":"O33-SUM(C33:M33)","v":0}]
["Employee related costs",null,null,null,null,null,null,null,null,null,null,null,null,1798912905,1798912905,1879949462,1964636935]
["Remuneration of councillors",null,null,null,null,null,null,null,null,null,null,null,null,62699935,62699935,65521432,68469897]
["Interest",null,null,null,null,null,null,null,null,null,null,null,null,40400878,40400878,42218918,44118769]
["Bulk purchases - Electricity",null,null,null,null,null,null,null,null,null,null,null,null,2921100000,2921100000,3526843000,4055869450]
["Acquisitions - water & other inventory",null,null,null,null,null,null,null,null,null,null,null,null,1110149118,1110149118,1164533075,1219405179]
[]
["Contracted services",null,null,null,null,null,null,null,null,null,null,null,null,1129698624,1129698624,1196746209,1219405179]
["Transfers and subsidies - other municipalities",null,null,null,null,null,null,null,null,null,null,null,null,51023536,51023536,53395332,55899094]
["Transfers and subsidies - other",null,null,null,null,null,null,null,null,null,null,null,null,0,0,0,0]
["Other expenditure",null,null,null,null,null,null,null,null,null,null,null,null,254603223,254603223,260666475,272893145]
["Cash Payments by Type",{"$f":"SUM(B34:B43)","v":0},{"$f":"SUM(C34:C43)","v":0},{"$f":"SUM(D34:D43)","v":0},0,0,0,0,0,0,0,0,0,7368588219,7368588219,8189873903,8900697648]
["Other Cash Flows/Payments by Type"]
["Capital assets",null,null,null,null,null,null,null,null,null,null,null,null,{"$f":"O46-SUM(C46:M46)","v":768501055},768501055,668665745,515231794]
["Repayment of borrowing",null,null,null,null,null,null,null,null,null,null,null,null,{"$f":"O47-SUM(C47:M47)","v":23000000},23000000,24000000,26000000]
["Other Cash Flows/Payments",null,null,null,null,null,null,null,null,null,null,null,null,{"$f":"O48-SUM(C48:M48)","v":0}]
["Total Cash Payments by Type",{"$f":"SUM(B44:B48)","v":0},0,0,0,0,0,0,0,0,0,0,0,8160089274,8160089274,8882539648,9441929442]
["NET INCREASE/(DECREASE) IN CASH HELD",{"$f":"B32-B49","v":0},0,0,0,0,0,0,0,0,0,0,0,232001550.43000031,232001550.43000031,429021250.11000061,820459722.52000046]
["Cash/cash equivalents at the month/year beginning:",null,null,{"$f":"C52","v":0},{"$f":"D52","v":0},0,0,0,0,0,0,0,0,0,{"$f":"C51","v":0},{"$f":"O52","v":232001550.43000031},{"$f":"P52","v":661022800.54000092}]
["Cash/cash equivalents at the month/year end:",null,{"$f":"C50+C51","v":0},{"$f":"D50+D51","v":0},{"$f":"E50+E51","v":0},0,0,0,0,0,0,0,0,232001550.43000031,{"$f":"O50+O51","v":232001550.43000031},{"$f":"P50+P51","v":661022800.54000092},{"$f":"Q50+Q51","v":1481482523.0600014}]
[{"$f":"head27a","v":"References"}]
["1. Replace 'budget' heading with adjusted budget, or 'outcome' only for month/s complete"]
["2. Total of monthly amounts must always agree to the approved or adjusted budget"]
["3. Amend 'cash-at-beginning' when prior year actual known (as part of the adjustments budget)"]
[]
[]
[]
[]
[null,null,null,null,{"$f":"E44+E60","v":0},0,0,0,0,0,0,0,null,{"$f":"N44+N60","v":7368588219},{"$f":"O44+O60","v":7368588219},{"$f":"P44+P60","v":8189873903}]
[null,null,null,null,{"$f":"E50-E60","v":0},0,0,0,0,0,0,0,{"$f":"M50-M60","v":0},{"$f":"N50-N60","v":232001550.43000031},232001550.43000031,429021250.11000061]

{"sheet":"SC10","index":26,"n_rows":56,"n_cols":11,"rows_kept":56,"cut":false,"hidden":false,"merged":[[1,0,2,0],[1,1,2,1],[0,0,0,10]]}
[{"$f":"muni& \" - \"&S71P& \" - \"&Head57","v":"KZN225 Msunduzi - Supporting Table SC10 Monthly Budget Statement  - Parent Municipality Financial Performance (revenue and expenditure)  - M11 May"}]
[{"$f":"desc","v":"Description"},{"$f":"head27","v":"Ref"},{"$f":"Head1","v":"2022/23"},{"$f":"Head2","v":"Budget Year 2023/24"}]
[null,null,{"$f":"Head5","v":"Audited Outcome"},{"$f":"Head6","v":"Original Budget"},{"$f":"Head7","v":"Adjusted Budget"},{"$f":"Head38","v":"Monthly actual"},{"$f":"Head39","v":"YearTD actual"},"YearTD budget",{"$f":"Head41","v":"YTD variance"},{"$f":"Head41","v":"YTD variance"},{"$f":"Head8","v":"Full Year Forecast"}]
["R thousands",1,null,null,null,null,null,null,null,"%"]
[{"$f":"'C4-FinPerf RE'!A5","v":"Revenue"}]
["Exchange Revenue"]
["Service charges - Electricity ",null,2724539631,3892818095.6607995,3673354756.4900575,-92356424.5,2135205618.95,{"$f":"E7/12*11","v":3367241860.1158857},{"$f":"G7-H7","v":-1232036241.1658857},{"$f":"IF(I7=0,\"\",I7/H7)","v":-0.36588884682120348},{"$f":"E7","v":3673354756.4900575}]
["Service charges - Water ",null,824368756,901571501.7650001,901571501.7650001,10724566.279999994,688939883.78999996,{"$f":"E8/12*11","v":826440543.28458333},-137500659.49458337,-0.16637695308134859,{"$f":"E8","v":901571501.7650001}]
["Service charges - Waste Water Management",null,197959736,202499871.93920001,202499871.93920001,4598530.49,177251976.72,185624882.61093336,-8372905.8909333646,-4.5106592247564324E-2,202499871.93920001]
["Service charges - Waste management",null,123629075,138741765.12349999,138741765.12349999,6601718.2400000002,114594181.60000001,127179951.36320832,-12585769.763208315,-9.896032848184616E-2,138741765.12349999]
["Sale of Goods and Rendering of Services",null,null,null,0,null,null,0,0,{"$f":"IF(I11=0,\"\",I11/H11)","v":""},0]
["Agency services",null,2598950,714790.32380000001,714790.32380000001,636738,3226607,655224.46348333335,2571382.5365166664,3.9244299928097441,714790.32380000001]
["Interest",null,null,null,0,null,null,0,0,"",0]
["Interest earned from Receivables",null,221878154.42999998,198174144,198174144,35554245.37000002,343702629.01999992,181659632,162042997.01999992,0.89201434152415282,198174144]
["Interest earned from Current and Non Current Assets",null,null,18052025.281800002,18052025.281800002,null,null,16547689.841650002,-16547689.841650002,-1,18052025.281800002]
["Dividends",null,null,null,0,null,null,0,0,"",0]
["Rent on Land",null,null,null,0,null,null,0,0,"",0]
["Rental from Fixed Assets",null,20071337.020000007,104823531.74793798,104823531.74793798,1631243.8599999999,27744558.259999998,96088237.435609818,-68343679.175609827,-0.71125957765026093,104823531.74793798]
["Licence and permits",null,null,2451743.9566758568,2451743.9566758568,108099.68,1919774.97,2247431.9602862019,-327656.99028620194,-0.14579172854891503,2451743.9566758568]
["Operational Revenue",null,68505983,230407182.35087389,230407182.35087389,4936819.9000000004,73579692.600000009,211206583.82163441,-137626891.22163439,-0.65162216409816731,230407182.35087389]
["Non-Exchange Revenue",null,null,null,null,null,null,0,0,"",0]
["Property rates",null,1370173436,1526985081.6338,1526985081.6338,123177547.8,1287594364.2099998,1399736324.8309834,-112141960.6209836,-8.0116489535644944E-2,1526985081.6338]
["Surcharges and Taxes",null,null,null,0,null,null,0,0,null,0]
["Fines, penalties and forfeits",null,20129364.789999999,14659914.477071574,14659914.477071574,3674035.55,31378563.359999999,13438254.937315609,17940308.42268439,1.3350177166878558,14659914.477071574]
["Licences or permits",null,2415455.89,null,0,null,null,0,0,null,0]
["Transfer and subsidies - Operational",null,801751325,838135150,846015625.88,7062702.5299999993,817373542.76999986,775514323.72333336,41859219.046666503,5.3976074672219571E-2,846015625.88]
["Interest",null,16957184.810000002,50691327,50691327,4421313.24,38841623.079999998,46467049.75,-7625426.6700000018,-0.16410395562072461,50691327]
["Fuel Levy",null,null,null,0,null,null,null,0,""]
["Operational Revenue",null,null,null,0,null,null,null,0,""]
["Gains on disposal of Assets",null,null,null,0,null,null,null,0,""]
["Other Gains",null,28624786,null,0,null,null,null,0,""]
["Discontinued Operations",null,null,null,0,null,null,null,0,""]
["Total Revenue (excluding capital transfers and contributions)",null,{"$f":"SUM(C7:C20)+SUM(C22:C32)","v":6423603174.9400005},{"$f":"SUM(D7:D20)+SUM(D22:D32)","v":8120726125.2604589},7909143261.969717,{"$f":"SUM(F7:F20)+SUM(F22:F32)","v":110771136.44000001},{"$f":"SUM(G7:G20)+SUM(G22:G32)","v":5741353016.329999},{"$f":"SUM(H7:H20)+SUM(H22:H32)","v":7250047990.1389074},{"$f":"G33-H33","v":-1508694973.8089085},-0.20809448101046329,{"$f":"SUM(K7:K20)+SUM(K22:K32)","v":7909143261.969717}]
["Expenditure By Type"]
["Employee related costs",null,1466855856,1781210508,1716571721.6399972,125140895.89000003,1433891584.5099978,{"$f":"E35/12*11","v":1573524078.1699975},{"$f":"G35-H35","v":-139632493.65999961},{"$f":"IF(I35=0,\"\",I35/H35)","v":-8.8738707972229866E-2},{"$f":"E35","v":1716571721.6399972}]
["Remuneration of councillors",null,51817506.850000001,62699934.989999995,62699934.989999995,4719825.7600000007,58539389.640000008,57474940.407499999,1064449.2325000092,1.8520232034222477E-2,62699934.989999995]
["Bulk purchases - electricity",null,2350400904.9499998,2514000000,2714000000,193382044.99000001,2384133018.4700003,2487833333.333333,-103700314.86333275,-4.1682983129898613E-2,2714000000]
["Inventory consumed",null,739336381,970629036,878190465.65999961,83888277.819999993,780963916.43999982,805007926.85499954,-24044010.414999723,-2.9868041807904585E-2,878190465.65999961]
["Debt impairment",null,71195569,600000000,600000000,5048248.8,20572779.620000001,550000000,-529427220.38,-0.96259494614545449,600000000]
["Depreciation and amortisation",null,350683902,460781797,462450178.23999989,31765602.540000003,335254486.78000003,423912663.38666654,-88658176.606666505,-0.20914255285126521,462450178.23999989]
["Interest",null,143221895,40400879.723359942,40400879.723359942,1943046.92,60989928.900000006,37034139.746413276,23955789.15358673,0.64685690872316881,40400879.723359942]
["Contracted services",null,799398801,994210937,855790559.6400001,92892251.940000027,702470082.0200001,784474679.6700002,-82004597.650000095,-0.10453440980975502,855790559.6400001]
["Transfers and subsidies",null,29562255,65884469.286639996,14626601.039999999,4601219.6500000013,45635538.919999987,13407717.619999999,32227821.29999999,2.4036769130583755,14626601.039999999]
["Irrecoverable debts written off",null,null,null,0,0,0,0,0,""]
["Operational costs",null,186190577,215382233,219281049.24999985,44541671.329999961,185775757.81999981,201007628.47916654,-15231870.659166723,-7.5777575082158793E-2,{"$f":"E45","v":219281049.24999985}]
["Losses on disposal of Assets",null,null,null,0,0,0]
["Other Losses",null,33578498,null,0,0,0]
["Total Expenditure",null,{"$f":"SUM(C35:C47)","v":6222242145.7999992},{"$f":"SUM(D35:D47)","v":7705199795},7564011390.1833572,587923085.63999999,6008226483.119997,6933677107.6680765,-925450624.54807949,-0.13347183755133438,{"$f":"SUM(K35:K47)","v":7564011390.1833572}]
[{"$f":"'C4-FinPerf RE'!A49","v":"Surplus/(Deficit)"},null,{"$f":"C33-C48","v":201361029.1400013},415526330.26045895,345131871.78635979,-477151949.19999999,-266873466.78999805,316370882.47083092,-583244349.26082897,-1.8435462350572149,{"$f":"K33-K48","v":345131871.78635979}]
[{"$f":"'C4-FinPerf RE'!A50","v":"Transfers and subsidies - capital (monetary allocations)"},null,324319270,448700054.94999999,536156203.44999993,33495287.880000003,365842655.19999999,{"$f":"E50/12*11","v":491476519.82916665},-125633864.62916666,-0.25562536471291852,{"$f":"E50","v":536156203.44999993}]
[{"$f":"'C4-FinPerf RE'!A51","v":"Transfers and subsidies - capital (in-kind)"},null,null,null,null,null,null,null,0,""]
[{"$f":"'C4-FinPerf RE'!A52","v":"Surplus/(Deficit) after capital transfers & contributions"},null,{"$f":"C49+SUM(C50:C51)","v":525680299.1400013},864226385.21045899,881288075.23635972,-443656661.31999999,98969188.410001934,807847402.29999757,-708878213.88999557,-0.877490243667022,{"$f":"K49+SUM(K50:K51)","v":881288075.23635972}]
[{"$f":"'C4-FinPerf RE'!A53","v":"Income Tax"},null,null,null,null,null,null,null,0,""]
[{"$f":"'C4-FinPerf RE'!A54","v":"Surplus/(Deficit) after income tax"},null,{"$f":"C52-C53","v":525680299.1400013},864226385.21045899,881288075.23635972,-443656661.31999999,98969188.410001934,807847402.29999757,-708878213.88999557,-0.877490243667022,{"$f":"K52-K53","v":881288075.23635972}]
[{"$f":"head27a","v":"References"}]
["1. Votes (consolidated) are revenue sources and expenditure type"]

{"sheet":"SC11","index":27,"n_rows":49,"n_cols":11,"rows_kept":49,"cut":false,"hidden":false,"merged":[[1,0,2,0],[1,1,2,1],[0,0,0,10],[1,3,1,10]]}
[{"$f":"muni& \" - \"&S71Q& \" - \"&Head57","v":"KZN225 Msunduzi - Supporting Table SC11 Monthly Budget Statement - summary of municipal entities - M11 May"}]
[{"$f":"desc","v":"Description"},{"$f":"head27","v":"Ref"},{"$f":"Head1","v":"2022/23"},{"$f":"Head2","v":"Budget Year 2023/24"}]
[null,null,{"$f":"Head5","v":"Audited Outcome"},{"$f":"Head6","v":"Original Budget"},{"$f":"Head7","v":"Adjusted Budget"},{"$f":"Head38","v":"Monthly actual"},{"$f":"Head39","v":"YearTD actual"},{"$f":"Head40","v":"YearTD budget"},{"$f":"Head41","v":"YTD variance"},{"$f":"Head41","v":"YTD variance"},{"$f":"Head8","v":"Full Year Forecast"}]
["R thousands",null,null,null,null,null,null,null,null,"%"]
["Revenue By Municipal Entity"]
["Insert name of municipal entity",null,null,null,null,null,null,null,{"$f":"G6-H6","v":0},{"$f":"IF(I6=0,\"\",I6/H6)","v":""}]
[null,null,null,null,null,null,null,null,0,{"$f":"IF(I7=0,\"\",I7/H7)","v":""}]
[null,null,null,null,null,null,null,null,0,""]
[null,null,null,null,null,null,null,null,0,""]
[null,null,null,null,null,null,null,null,0,""]
[null,null,null,null,null,null,null,null,0,""]
[null,null,null,null,null,null,null,null,0,""]
[null,null,null,null,null,null,null,null,0,""]
[null,null,null,null,null,null,null,null,0,""]
[null,null,null,null,null,null,null,null,0,""]
["Total Operating Revenue",1,{"$f":"SUM(C6:C15)","v":0},0,0,0,0,0,0,"",{"$f":"SUM(K6:K15)","v":0}]
[]
["Expenditure By Municipal Entity"]
[{"$f":"A6","v":"Insert name of municipal entity"},null,null,null,null,null,null,null,0,{"$f":"IF(I19=0,\"\",I19/H19)","v":""}]
[{"$f":"IF(A7=\"\",\"\",A7)","v":""},null,null,null,null,null,null,null,0,""]
[{"$f":"IF(A8=\"\",\"\",A8)","v":""},null,null,null,null,null,null,null,0,""]
["",null,null,null,null,null,null,null,0,""]
["",null,null,null,null,null,null,null,0,""]
["",null,null,null,null,null,null,null,0,""]
["",null,null,null,null,null,null,null,0,""]
["",null,null,null,null,null,null,null,0,""]
["",null,null,null,null,null,null,null,0,""]
["",null,null,null,null,null,null,null,0,""]
["Total Operating Expenditure",2,{"$f":"SUM(C19:C28)","v":0},0,0,0,0,0,0,"",{"$f":"SUM(K19:K28)","v":0}]
[null,null,null,null,null,null,null,null,null,""]
[{"$f":"Head42","v":"Surplus/ (Deficit) for the yr/period"},null,{"$f":"C16-C29","v":0},{"$f":"D16-D29","v":0},0,0,0,0,{"$f":"I16+I29","v":0},"",0]
["Capital Expenditure By Municipal Entity"]
[{"$f":"$A$6","v":"Insert name of municipal entity"},null,null,null,null,null,null,null,0,""]
[{"$f":"IF(A7=\"\",\"\",A7)","v":""},null,null,null,null,null,null,null,0,""]
[{"$f":"IF(A8=\"\",\"\",A8)","v":""},null,null,null,null,null,null,null,0,""]
["",null,null,null,null,null,null,null,0,""]
["",null,null,null,null,null,null,null,0,""]
["",null,null,null,null,null,null,null,0,""]
["",null,null,null,null,null,null,null,0,""]
["",null,null,null,null,null,null,null,0,""]
["",null,null,null,null,null,null,null,0,""]
[null,null,null,null,null,null,null,null,null,""]
["Total Capital Expenditure",3,{"$f":"SUM(C32:C42)","v":0},{"$f":"SUM(D32:D42)","v":0},0,0,0,{"$f":"SUM(H32:H42)","v":0},{"$f":"G43-H43","v":0},"",0]
[{"$f":"head27a","v":"References"}]
["1. Must reconcile to the sum of all municipal entity monthly revenue reports"]
["2. Must reconcile to the sum of all municipal entity monthly expenditure reports"]
["3. YTD = Year to date; FAV - favourable variance or unfavourable variance"]
["4. Material variances to be explained"]
["5. Insert additional 'Adjustment' Budget column for each Adjustment made by an entity"]

{"sheet":"SC12","index":28,"n_rows":23,"n_cols":10,"rows_kept":23,"cut":false,"hidden":false,"merged":[[1,0,2,0],[0,0,0,9],[1,2,1,9]]}
[{"$f":"muni& \" - \"&S71R& \" - \"&Head57","v":"KZN225 Msunduzi - Supporting Table SC12 Consolidated Monthly Budget Statement - capital expenditure trend  - M11 May"}]
["Month",{"$f":"Head1","v":"2022/23"},{"$f":"Head2","v":"Budget Year 2023/24"}]
[null,{"$f":"Head5","v":"Audited Outcome"},{"$f":"Head6","v":"Original Budget"},{"$f":"Head7","v":"Adjusted Budget"},{"$f":"Head38","v":"Monthly actual"},{"$f":"Head39","v":"YearTD actual"},{"$f":"Head40","v":"YearTD budget"},{"$f":"Head41","v":"YTD variance"},{"$f":"Head41","v":"YTD variance"},"% spend of Original Budget"]
["R thousands",null,null,null,null,null,null,null,"%"]
["Monthly expenditure performance trend"]
["July",45649152.340833329,64063337.833333336,66878662.787499994,16309726.66,{"$f":"IF(E6>0,E6,\"\")","v":16309726.66},{"$f":"IF(D6>0,D6,C6)","v":66878662.787499994},{"$f":"IF(F6=\"\",0,G6-F6)","v":50568936.127499998},{"$f":"IF(F6=\"\",\"\",IF(H6=0,\"\",H6/G6))","v":0.75612959380150202},{"$f":"IF(F6=\"\",\"\",F6/$C$18)","v":2.1215627132468044E-2}]
["August",45649152.340833329,64063337.833333336,66878662.787499994,37529936.129999995,{"$f":"IF(E7>0,E7+F6,\"\")","v":53839662.789999992},{"$f":"IF(D7>0,D7+D6,C7+C6)","v":133757325.57499999},79917662.784999996,0.59748251126768237,7.0034417774261698E-2]
["September",45649152.340833329,64063337.833333336,66878662.787499994,51170632.060000002,{"$f":"IF(E8>0,E8+F7,\"\")","v":105010294.84999999},{"$f":"IF(D8>0,D8+G7,C8+G7)","v":200635988.36249998},95625693.512499988,0.47661286638032174,0.13659697106218266]
["October",45649152.340833329,64063337.833333336,66878662.787499994,7816322.8100000005,112826617.66,{"$f":"IF(D9>0,D9+G8,C9+G8)","v":267514651.14999998},154688033.48999998,0.57824135173540003,0.14676441247557326]
["November",45649152.340833329,64063337.833333336,66878662.787499994,79015351.729999989,191841969.38999999,334393313.9375,142551344.54750001,0.42629842944211399,0.24954726561533849]
["December",45649152.340833329,64063337.833333336,66878662.787499994,73006446.530000001,264848415.91999999,401271976.72500002,136423560.80500004,0.33997779241507792,0.34451375893160019]
["January",45649152.340833329,64063337.833333336,66878662.787499994,12141450.92,276989866.83999997,468150639.51250005,191160772.67250007,0.40833175593129978,0.36030730967194602]
["February",45649152.340833329,64063337.833333336,66878662.787499994,19214834.099999998,296204700.94,535029302.30000007,238824601.36000007,0.4463766756948333,0.38530188892983241]
["March",45649152.340833329,64063337.833333336,66878662.787499994,116596464.84,412801165.77999997,601907965.0875001,189106799.30750012,0.31417892813564852,0.5369701035220541]
["April",45649152.340833329,64063337.833333336,66878662.787499994,34296575.730000004,447097741.50999999,668786627.87500012,221688886.36500013,0.33147924483686747,0.58158295190244091]
["May",45649152.340833329,64063337.833333336,66878662.787499994,66307801.810000002,513405543.31999999,735665290.66250014,222259747.34250015,0.30212074725225257,0.66783587498941499]
["June",45649152.340833329,64063337.833333336,66878662.787499994,null,"",802543953.45000017,{"$f":"IF(F17=\"\",0,G17-F17)","v":0},{"$f":"IF(F17=\"\",\"\",IF(H17=0,\"\",H17/G17))","v":""},{"$f":"IF(F17=\"\",\"\",F17/$C$18)","v":""}]
["Total Capital expenditure",{"$f":"SUM(B6:B17)","v":547789828.08999979},{"$f":"SUM(C6:C17)","v":768760054.00000012},{"$f":"SUM(D6:D17)","v":802543953.45000017},{"$f":"SUM(E6:E17)","v":513405543.31999999}]
[]
[]
[]
[]
[null," "]

{"sheet":"SC13a","index":29,"n_rows":178,"n_cols":11,"rows_kept":178,"cut":false,"hidden":false,"merged":[[1,0,2,0],[1,1,2,1],[0,0,0,10]]}
[{"$f":"muni& \" - \"&S71Sa& \" - \"&Head57","v":"KZN225 Msunduzi - Supporting Table SC13a Consolidated Monthly Budget Statement - capital expenditure on new assets by asset class - M11 May"}]
[{"$f":"desc","v":"Description"},{"$f":"head27","v":"Ref"},{"$f":"Head1","v":"2022/23"},{"$f":"Head2","v":"Budget Year 2023/24"}]
[null,null,{"$f":"Head5","v":"Audited Outcome"},{"$f":"Head6","v":"Original Budget"},{"$f":"Head7","v":"Adjusted Budget"},{"$f":"Head38","v":"Monthly actual"},{"$f":"Head39","v":"YearTD actual"},"YearTD budget",{"$f":"Head41","v":"YTD variance"},{"$f":"Head41","v":"YTD variance"},{"$f":"Head8","v":"Full Year Forecast"}]
["R thousands",1,null,null,null,null,null,null,null,"%"]
["Capital expenditure on new assets by Asset Class/Sub-class"]
[]
["Infrastructure",null,{"$f":"C8+C13+C17+C27+C38+C45+C53+C63+C69","v":83119217.970000014},291587640,161161590,9050509.8499999996,74612529.469999999,147731457.5,{"$f":"H7-G7","v":73118928.030000001},{"$f":"IF(I7=0,\"\",I7/H7)","v":0.49494487678766724},{"$f":"K8+K13+K17+K27+K38+K45+K53+K63+K69","v":161161590}]
["Roads Infrastructure",null,{"$f":"SUM(C9:C12)","v":2069740.91},2250000,2250000,0,249801.56,2062500,1812698.44,0.8788840921212121,{"$f":"SUM(K9:K12)","v":2250000}]
["Roads",null,2069740.91,2250000,2250000,null,249801.56,{"$f":"E9/12*11","v":2062500},1812698.44,0.8788840921212121,{"$f":"E9","v":2250000}]
["Road Structures",null,null,null,null,null,null,null,0,""]
["Road Furniture",null,null,null,null,null,null,null,0,""]
["Capital Spares",null,null,null,null,null,null,null,0,""]
["Storm water Infrastructure",null,{"$f":"SUM(C14:C16)","v":0},0,0,0,0,0,0,"",{"$f":"SUM(K14:K16)","v":0}]
["Drainage Collection",null,null,null,null,null,null,null,0,""]
["Storm water Conveyance",null,null,null,null,null,null,null,0,""]
["Attenuation",null,null,null,null,null,null,null,0,""]
["Electrical Infrastructure",null,{"$f":"SUM(C18:C26)","v":63108055.520000011},194000000,106674950,8758612.75,41017770.200000003,97785370.833333328,56767600.633333325,0.58053265176126156,{"$f":"SUM(K18:K26)","v":106674950}]
["Power Plants",null,63108055.520000011,194000000,106674950,8758612.75,41017770.200000003,{"$f":"E18/12*11","v":97785370.833333328},56767600.633333325,0.58053265176126156,{"$f":"E18","v":106674950}]
["HV Substations",null,null,null,null,null,null,null,0,""]
["HV Switching Station",null,null,null,null,null,null,null,0,""]
["HV Transmission Conductors",null,null,null,null,null,null,null,0,""]
["MV Substations",null,null,null,null,null,null,null,0,""]
["MV Switching Stations",null,null,null,null,null,null,null,0,""]
["MV Networks",null,null,null,null,null,null,null,0,""]
["LV Networks",null,null,null,null,null,null,null,0,""]
["Capital Spares",null,null,null,null,null,null,null,0,""]
["Water Supply Infrastructure",null,{"$f":"SUM(C28:C37)","v":4743063.1400000006},29860000,22860000,248472.1,7254620.21,20955000,13700379.789999999,0.65380003769983297,{"$f":"SUM(K28:K37)","v":22860000}]
["Dams and Weirs",null,null,null,null,null,null,null,0,""]
["Boreholes",null,null,null,null,null,null,null,0,""]
["Reservoirs",null,4743063.1400000006,29860000,22860000,248472.1,7254620.21,{"$f":"E30/12*11","v":20955000},13700379.789999999,0.65380003769983297,{"$f":"E30","v":22860000}]
["Pump Stations",null,null,null,null,null,null,null,0,""]
["Water Treatment Works",null,null,null,null,null,null,null,0,""]
["Bulk Mains",null,null,null,null,null,null,null,0,""]
["Distribution",null,null,null,null,null,null,null,0,""]
["Distribution Points",null,null,null,null,null,null,null,0,""]
["PRV Stations",null,null,null,null,null,null,null,0,""]
["Capital Spares",null,null,null,null,null,null,null,0,""]
["Sanitation Infrastructure",null,{"$f":"SUM(C39:C44)","v":11810585.4},65477640,29376640,43425,26090337.5,26928586.666666668,838249.16666666791,3.1128598654020258E-2,{"$f":"SUM(K39:K44)","v":29376640}]
["Pump Station",null,null,null,null,null,null,null,0,""]
["Reticulation",null,11810585.4,65477640,29376640,43425,26090337.5,{"$f":"E40/12*11","v":26928586.666666668},{"$f":"H40-G40","v":838249.16666666791},{"$f":"IF(I40=0,\"\",I40/H40)","v":3.1128598654020258E-2},{"$f":"E40","v":29376640}]
["Waste Water Treatment Works",null,null,null,null,null,null,null,{"$f":"H41-G41","v":0},{"$f":"IF(I41=0,\"\",I41/H41)","v":""}]
["Outfall Sewers",null,null,null,null,null,null,null,{"$f":"H42-G42","v":0},{"$f":"IF(I42=0,\"\",I42/H42)","v":""}]
["Toilet Facilities",null,null,null,null,null,null,null,0,""]
["Capital Spares",null,null,null,null,null,null,null,0,""]
["Solid Waste Infrastructure",null,{"$f":"SUM(C46:C52)","v":1387773},0,0,0,0,0,0,"",{"$f":"SUM(K46:K52)","v":0}]
["Landfill Sites",null,1387773,null,null,null,null,null,0,""]
["Waste Transfer Stations",null,null,null,null,null,null,null,0,""]
["Waste Processing Facilities",null,null,null,null,null,null,null,{"$f":"H48-G48","v":0},{"$f":"IF(I48=0,\"\",I48/H48)","v":""}]
["Waste Drop-off Points",null,null,null,null,null,null,null,0,""]
["Waste Separation Facilities",null,null,null,null,null,null,null,0,""]
["Electricity Generation Facilities",null,null,null,null,null,null,null,0,""]
["Capital Spares",null,null,null,null,null,null,null,0,""]
["Rail Infrastructure",null,{"$f":"SUM(C54:C62)","v":0},0,0,0,0,0,0,"",{"$f":"SUM(K54:K62)","v":0}]
["Rail Lines",null,null,null,null,null,null,null,0,""]
["Rail Structures",null,null,null,null,null,null,null,0,""]
["Rail Furniture",null,null,null,null,null,null,null,0,""]
["Drainage Collection",null,null,null,null,null,null,null,0,""]
["Storm water Conveyance",null,null,null,null,null,null,null,0,""]
["Attenuation",null,null,null,null,null,null,null,0,""]
["MV Substations",null,null,null,null,null,null,null,0,""]
["LV Networks",null,null,null,null,null,null,null,0,""]
["Capital Spares",null,null,null,null,null,null,null,0,""]
["Coastal Infrastructure",null,{"$f":"SUM(C64:C68)","v":0},0,0,0,0,0,0,"",{"$f":"SUM(K64:K68)","v":0}]
["Sand Pumps",null,null,null,null,null,null,null,0,""]
["Piers",null,null,null,null,null,null,null,0,""]
["Revetments",null,null,null,null,null,null,null,0,""]
["Promenades",null,null,null,null,null,null,null,0,""]
["Capital Spares",null,null,null,null,null,null,null,0,""]
["Information and Communication Infrastructure",null,{"$f":"SUM(C70:C73)","v":0},0,0,0,0,0,{"$f":"H69-G69","v":0},"",{"$f":"SUM(K70:K73)","v":0}]
["Data Centres",null,null,null,null,null,null,null,{"$f":"H70-G70","v":0},""]
["Core Layers",null,null,null,null,null,null,null,{"$f":"H71-G71","v":0},{"$f":"IF(I71=0,\"\",I71/H71)","v":""}]
["Distribution Layers",null,null,null,null,null,null,null,{"$f":"H72-G72","v":0},""]
["Capital Spares",null,null,null,null,null,null,null,{"$f":"H73-G73","v":0},""]
[null,null,null,null,null,null,null,null,null,""]
["Community Assets",null,{"$f":"+C76+C99","v":37936613.200000003},25607499.049999952,23243267,0,14071970,21306328.083333336,{"$f":"H75-G75","v":7234358.0833333358},0.33954034946980566,{"$f":"+K76+K99","v":23243267}]
["Community Facilities",null,{"$f":"SUM(C77:C98)","v":37936613.200000003},25607499.049999952,23243267,0,14071970,21306328.083333336,{"$f":"H76-G76","v":7234358.0833333358},0.33954034946980566,{"$f":"SUM(K77:K98)","v":23243267}]
["Halls",null,35823966.43,25607499.049999952,22169108,null,13274786.9,{"$f":"E77/12*11","v":20321682.333333336},7046895.4333333354,0.34676732554639061,{"$f":"E77","v":22169108}]
["Centres",null,197683.27,null,null,null,null,null,0,""]
["Crèches",null,null,null,null,null,null,null,0,""]
["Clinics/Care Centres",null,null,null,null,null,null,null,0,""]
["Fire/Ambulance Stations",null,null,null,null,null,null,null,0,""]
["Testing Stations",null,null,null,null,null,null,null,0,""]
["Museums",null,null,null,null,null,null,null,0,""]
["Galleries",null,null,null,null,null,null,null,0,""]
["Theatres",null,null,null,null,null,null,null,0,""]
["Libraries",null,null,null,null,null,null,null,0,""]
["Cemeteries/Crematoria",null,1907188.5,null,null,null,null,null,0,""]
["Police",null,null,null,1074159,null,797183.1,{"$f":"E88/12*11","v":984645.75},187462.65000000002,0.19038588243538351,{"$f":"E88","v":1074159}]
["Purls",null,null,null,null,null,null,null,0,""]
["Public Open Space",null,null,null,null,null,null,null,0,""]
["Nature Reserves",null,null,null,null,null,null,null,0,""]
["Public Ablution Facilities",null,null,null,null,null,null,null,0,""]
["Markets",null,null,null,null,null,null,null,0,""]
["Stalls",null,null,null,null,null,null,null,0,""]
["Abattoirs",null,null,null,null,null,null,null,0,""]
["Airports",null,null,null,null,null,null,null,0,""]
["Taxi Ranks/Bus Terminals",null,7775,null,null,null,null,null,0,""]
["Capital Spares",null,null,null,null,null,null,null,0,""]
["Sport and Recreation Facilities",null,{"$f":"SUM(C100:C102)","v":0},0,0,0,0,0,0,"",{"$f":"SUM(K100:K102)","v":0}]
["Indoor Facilities",null,null,null,null,null,null,null,0,""]
["Outdoor Facilities",null,null,null,null,null,null,null,0,""]
["Capital Spares",null,null,null,null,null,null,null,0,""]
["Heritage assets",null,{"$f":"SUM(C104:C108)","v":0},0,0,0,0,0,0,"",{"$f":"SUM(K104:K108)","v":0}]
["Monuments",null,null,null,null,null,null,null,0,""]
["Historic Buildings",null,null,null,null,null,null,null,0,""]
["Works of Art",null,null,null,null,null,null,null,0,""]
["Conservation Areas",null,null,null,null,null,null,null,0,""]
["Other Heritage",null,null,null,null,null,null,null,0,""]
[null,null,null,null,null,null,null,null,0,""]
["Investment properties",null,{"$f":"+C111+C114","v":0},0,0,0,0,0,0,"",{"$f":"+K111+K114","v":0}]
["Revenue Generating",null,{"$f":"SUM(C112:C113)","v":0},0,0,0,0,0,0,"",{"$f":"SUM(K112:K113)","v":0}]
["Improved Property",null,null,null,null,null,null,null,0,""]
["Unimproved Property",null,null,null,null,null,null,null,0,""]
["Non-revenue Generating",null,{"$f":"SUM(C115:C116)","v":0},0,0,0,0,0,0,"",{"$f":"SUM(K115:K116)","v":0}]
["Improved Property",null,null,null,null,null,null,null,0,""]
["Unimproved Property",null,null,null,null,null,null,null,0,""]
["Other assets",null,{"$f":"+C118+C130","v":12610993.109999999},145545414.94999999,134360154.94999999,8331172.8200000003,68136966.639999986,123163475.37083332,55026508.730833337,0.44677619371452321,{"$f":"+K118+K130","v":134360154.94999999}]
["Operational Buildings",null,{"$f":"SUM(C119:C129)","v":8244434.3699999992},10000000,3174740,4614821.42,13138120.449999999,2910178.3333333335,-10227942.116666665,-3.5145413597219406,{"$f":"SUM(K119:K129)","v":3174740}]
["Municipal Offices",null,-154600.82,null,null,null,null,null,0,""]
["Pay/Enquiry Points",null,null,null,null,null,null,null,0,""]
["Building Plan Offices",null,null,null,null,null,null,null,0,""]
["Workshops",null,8399035.1899999995,10000000,3174740,4614821.42,13138120.449999999,{"$f":"E122/12*11","v":2910178.3333333335},-10227942.116666665,-3.5145413597219406,{"$f":"E122","v":3174740}]
["Yards",null,null,null,null,null,null,null,0,""]
["Stores",null,null,null,null,null,null,null,0,""]
["Laboratories",null,null,null,null,null,null,null,0,""]
["Training Centres",null,null,null,null,null,null,null,0,""]
["Manufacturing Plant",null,null,null,null,null,null,null,0,""]
["Depots",null,null,null,null,null,null,null,0,""]
["Capital Spares",null,null,null,null,null,null,null,0,""]
["Housing",null,{"$f":"SUM(C131:C133)","v":4366558.74},135545414.94999999,131185414.95,3716351.4000000004,54998846.18999999,120253297.03749999,65254450.847500004,0.54264167765105809,{"$f":"SUM(K131:K133)","v":131185414.95}]
["Staff Housing",null,null,null,null,null,null,null,0,""]
["Social Housing",null,4366558.74,135545414.94999999,131185414.95,3716351.4000000004,54998846.18999999,{"$f":"E132/12*11","v":120253297.03749999},65254450.847500004,0.54264167765105809,{"$f":"E132","v":131185414.95}]
["Capital Spares",null,null,null,null,null,null,null,0,""]
[null,null,null,null,null,null,null,null,null,""]
["Biological or Cultivated Assets",null,{"$f":"SUM(C136:C136)","v":0},0,0,0,0,0,{"$f":"H135-G135","v":0},{"$f":"IF(I135=0,\"\",I135/H135)","v":""},{"$f":"SUM(K136)","v":0}]
["Biological or Cultivated Assets",null,null,null,null,null,null,null,{"$f":"H136-G136","v":0},""]
[null,null,null,null,null,null,null,null,null,""]
["Intangible Assets",null,{"$f":"SUM(C139:C140)","v":7986044},30000000,30000000,0,5771250,27500000,{"$f":"H138-G138","v":21728750},0.79013636363636364,{"$f":"SUM(K139:K140)","v":30000000}]
["Servitudes",null,null,null,null,null,null,{"$f":"E139/12*9","v":0},0,"",{"$f":"E139","v":0}]
["Licences and Rights",null,{"$f":"SUM(C141:C146)","v":7986044},30000000,30000000,0,5771250,27500000,21728750,0.79013636363636364,{"$f":"SUM(K141:K146)","v":30000000}]
["Water Rights",null,null,null,null,null,null,null,0,""]
["Effluent Licenses",null,null,null,null,null,null,null,0,""]
["Solid Waste Licenses",null,null,null,null,null,null,null,0,""]
["Computer Software and Applications",null,7986044,30000000,30000000,null,5771250,{"$f":"E144/12*11","v":27500000},21728750,0.79013636363636364,{"$f":"E144","v":30000000}]
["Load Settlement Software Applications",null,null,null,null,null,null,null,0,""]
["Unspecified",null,null,null,null,null,null,null,0,""]
[]
["Computer Equipment",null,{"$f":"SUM(C149:C149)","v":0},0,0,0,0,0,{"$f":"H148-G148","v":0},{"$f":"IF(I148=0,\"\",I148/H148)","v":""},{"$f":"SUM(K149)","v":0}]
["Computer Equipment",null,null,null,null,null,null,null,{"$f":"H149-G149","v":0},{"$f":"IF(I149=0,\"\",I149/H149)","v":""}]
[]
["Furniture and Office Equipment",null,{"$f":"SUM(C152:C152)","v":6315899.8399999999},15000000,24899006,1146699.23,15288642.039999999,22824088.833333336,{"$f":"H151-G151","v":7535446.7933333367},{"$f":"IF(I151=0,\"\",I151/H151)","v":0.33015323627413456},{"$f":"SUM(K152)","v":24899006}]
["Furniture and Office Equipment",null,6315899.8399999999,15000000,24899006,1146699.23,15288642.039999999,{"$f":"E152/12*11","v":22824088.833333336},{"$f":"H152-G152","v":7535446.7933333367},{"$f":"IF(I152=0,\"\",I152/H152)","v":0.33015323627413456},{"$f":"E152","v":24899006}]
[null,null,null,null,null,null,null,null,null,{"$f":"IF(I153=0,\"\",I153/H153)","v":""}]
["Machinery and Equipment",null,{"$f":"SUM(C155:C155)","v":9073299.7599999998},199000,28460254,5339140.4400000004,8588653,26088566.166666668,{"$f":"H154-G154","v":17499913.166666668},{"$f":"IF(I154=0,\"\",I154/H154)","v":0.67078861501504394},{"$f":"SUM(K155)","v":28460254}]
["Machinery and Equipment",null,9073299.7599999998,199000,28460254,5339140.4400000004,8588653,{"$f":"E155/12*11","v":26088566.166666668},{"$f":"H155-G155","v":17499913.166666668},{"$f":"IF(I155=0,\"\",I155/H155)","v":0.67078861501504394},{"$f":"E155","v":28460254}]
[]
["Transport Assets",null,{"$f":"SUM(C158:C158)","v":7759840.5199999996},0,22102800,0,13945465.359999999,20260900,{"$f":"H157-G157","v":6315434.6400000006},{"$f":"IF(I157=0,\"\",I157/H157)","v":0.31170553331786843},{"$f":"SUM(K158)","v":22102800}]
["Transport Assets",null,7759840.5199999996,null,22102800,null,13945465.359999999,{"$f":"E158/12*11","v":20260900},{"$f":"H158-G158","v":6315434.6400000006},{"$f":"IF(I158=0,\"\",I158/H158)","v":0.31170553331786843},{"$f":"E158","v":22102800}]
[]
["Land",null,{"$f":"SUM(C161:C161)","v":0},0,0,0,0,0,{"$f":"H160-G160","v":0},{"$f":"IF(I160=0,\"\",I160/H160)","v":""},{"$f":"SUM(K161)","v":0}]
["Land",null,null,null,null,null,null,null,{"$f":"H161-G161","v":0},{"$f":"IF(I161=0,\"\",I161/H161)","v":""}]
[]
["Zoo's, Marine and Non-biological Animals",null,{"$f":"SUM(C164:C164)","v":0},0,0,0,0,0,{"$f":"H163-G163","v":0},{"$f":"IF(I163=0,\"\",I163/H163)","v":""},{"$f":"SUM(K164)","v":0}]
["Zoo's, Marine and Non-biological Animals",null,null,null,null,null,null,null,{"$f":"H164-G164","v":0},{"$f":"IF(I164=0,\"\",I164/H164)","v":""}]
[]
["Living resources",null,{"$f":"+C167+C170","v":0},0,0,0,0,0,{"$f":"H166-G166","v":0},{"$f":"IF(I166=0,\"\",I166/H166)","v":""},0]
["Mature",null,{"$f":"+C168+C169","v":0},0,0,0,0,0,0,"",0]
["Policing and Protection",null,null,null,null,null,null,null,0,""]
["Zoological plants and animals",null,null,null,null,null,null,null,0,""]
["Immature",null,{"$f":"+C171+C172","v":0},{"$f":"+D171+D172","v":0},0,0,0,0,0,"",{"$f":"+K171+K172","v":0}]
["Policing and Protection",null,null,null,null,null,null,null,0,""]
["Zoological plants and animals",null,null,null,null,null,null,null,0,""]
["Total Capital Expenditure on new assets",1,{"$f":"C7+C75+C103+C110+C117+C135+C138+C148+C151+C154+C157+C160+C163+C166","v":164801908.40000004},507939553.99999994,424227071.94999999,23867522.340000004,200415476.50999999,388874815.95416665,{"$f":"H173-G173","v":188459339.44416666},{"$f":"IF(I173=0,\"\",I173/H173)","v":0.48462726747102786},{"$f":"K7+K75+K103+K110+K117+K135+K138+K148+K151+K154+K157+K160+K163+K166","v":424227071.94999999}]
[]
[{"$f":"head27a","v":"References"}]
["1. Total Capital Expenditure on new assets (SC13a) plus Total Capital Expenditure on renewal of existing assets (SC13b) plus Total Capital Expenditure on upgrading of existing assets (SC13e)  must reconcile to total capital expenditure in Table C5"]
[]
["check balance",null,{"$f":"C173+SC13b!C173+SC13e!C173-'C5-Capex'!C40","v":0},{"$f":"D173+SC13b!D173+SC13e!D173-'C5-Capex'!D40","v":0},{"$f":"E173+SC13b!E173+SC13e!E173-'C5-Capex'!E40","v":0},{"$f":"F173+SC13b!F173+SC13e!F173-'C5-Capex'!F40","v":0},{"$f":"G173+SC13b!G173+SC13e!G173-'C5-Capex'!G40","v":0},{"$f":"H173+SC13b!H173+SC13e!H173-'C5-Capex'!H40","v":0},null,null,{"$f":"K173+SC13b!K173+SC13e!K173-'C5-Capex'!K40","v":0}]

{"sheet":"SC13b","index":30,"n_rows":178,"n_cols":11,"rows_kept":178,"cut":false,"hidden":false,"merged":[[0,0,0,10],[1,0,2,0],[1,1,2,1]]}
[{"$f":"muni& \" - \"&S71Sb& \" - \"&Head57","v":"KZN225 Msunduzi - Supporting Table SC13b Consolidated Monthly Budget Statement - capital expenditure on renewal of existing assets by asset class - M11 May"}]
[{"$f":"desc","v":"Description"},{"$f":"head27","v":"Ref"},{"$f":"Head1","v":"2022/23"},{"$f":"Head2","v":"Budget Year 2023/24"}]
[null,null,{"$f":"Head5","v":"Audited Outcome"},{"$f":"Head6","v":"Original Budget"},{"$f":"Head7","v":"Adjusted Budget"},{"$f":"Head38","v":"Monthly actual"},{"$f":"Head39","v":"YearTD actual"},"YearTD budget",{"$f":"Head41","v":"YTD variance"},{"$f":"Head41","v":"YTD variance"},{"$f":"Head8","v":"Full Year Forecast"}]
["R thousands",1,null,null,null,null,null,null,null,"%"]
["Capital expenditure on renewal of existing assets by Asset Class/Sub-class"]
[]
["Infrastructure",null,{"$f":"C8+C13+C17+C27+C38+C45+C53+C63+C69","v":115550660.13999999},47356000,27040000,17768736.079999998,81794197.320000008,24786666.666666668,{"$f":"H7-G7","v":-57007530.653333336},{"$f":"IF(I7=0,\"\",I7/H7)","v":-2.2999272721893491},{"$f":"K8+K13+K17+K27+K38+K45+K53+K63+K69","v":27040000}]
["Roads Infrastructure",null,{"$f":"SUM(C9:C12)","v":115550660.13999999},33150000,20000000,17141324.289999999,79480056.790000007,18333333.333333336,-61146723.456666671,-3.3352758249090906,{"$f":"SUM(K9:K12)","v":20000000}]
["Roads",null,115550660.13999999,33150000,20000000,17141324.289999999,79480056.790000007,{"$f":"E9/12*11","v":18333333.333333336},-61146723.456666671,-3.3352758249090906,{"$f":"E9","v":20000000}]
["Road Structures",null,null,null,null,null,null,null,0,""]
["Road Furniture",null,null,null,null,null,null,null,0,""]
["Capital Spares",null,null,null,null,null,null,null,0,""]
["Storm water Infrastructure",null,{"$f":"SUM(C14:C16)","v":0},0,0,0,0,0,0,"",{"$f":"SUM(K14:K16)","v":0}]
["Drainage Collection",null,null,null,null,null,null,null,0,""]
["Storm water Conveyance",null,null,null,null,null,null,null,0,""]
["Attenuation",null,null,null,null,null,null,null,0,""]
["Electrical Infrastructure",null,{"$f":"SUM(C18:C26)","v":0},0,0,0,0,0,0,"",{"$f":"SUM(K18:K26)","v":0}]
["Power Plants",null,null,null,null,null,null,null,0,""]
["HV Substations",null,null,null,null,null,null,null,0,""]
["HV Switching Station",null,null,null,null,null,null,null,0,""]
["HV Transmission Conductors",null,null,null,null,null,null,null,0,""]
["MV Substations",null,null,null,null,null,null,null,0,""]
["MV Switching Stations",null,null,null,null,null,null,null,0,""]
["MV Networks",null,null,null,null,null,null,null,0,""]
["LV Networks",null,null,null,null,null,null,null,0,""]
["Capital Spares",null,null,null,null,null,null,null,0,""]
["Water Supply Infrastructure",null,{"$f":"SUM(C28:C37)","v":0},0,0,0,0,0,0,"",{"$f":"SUM(K28:K37)","v":0}]
["Dams and Weirs",null,null,null,null,null,null,null,0,""]
["Boreholes",null,null,null,null,null,null,null,0,""]
["Reservoirs",null,null,null,null,null,null,null,0,""]
["Pump Stations",null,null,null,null,null,null,null,0,""]
["Water Treatment Works",null,null,null,null,null,null,null,0,""]
["Bulk Mains",null,null,null,null,null,null,null,0,""]
["Distribution",null,null,null,null,null,null,null,0,""]
["Distribution Points",null,null,null,null,null,null,null,0,""]
["PRV Stations",null,null,null,null,null,null,null,0,""]
["Capital Spares",null,null,null,null,null,null,null,0,""]
["Sanitation Infrastructure",null,{"$f":"SUM(C39:C44)","v":0},0,7040000,627411.79,2314140.5300000003,6453333.333333333,4139192.8033333328,0.64140384349173551,{"$f":"SUM(K39:K44)","v":7040000}]
["Pump Station",null,null,null,null,null,null,null,0,""]
["Reticulation",null,null,null,7040000,627411.79,2314140.5300000003,{"$f":"E40/12*11","v":6453333.333333333},4139192.8033333328,0.64140384349173551,{"$f":"E40","v":7040000}]
["Waste Water Treatment Works",null,null,null,null,null,null,null,0,""]
["Outfall Sewers",null,null,null,null,null,null,null,0,""]
["Toilet Facilities",null,null,null,null,null,null,null,0,""]
["Capital Spares",null,null,null,null,null,null,null,0,""]
["Solid Waste Infrastructure",null,{"$f":"SUM(C46:C52)","v":0},0,0,0,0,0,0,"",{"$f":"SUM(K46:K52)","v":0}]
["Landfill Sites",null,null,null,null,null,null,null,0,""]
["Waste Transfer Stations",null,null,null,null,null,null,null,0,""]
["Waste Processing Facilities",null,null,null,null,null,null,null,0,""]
["Waste Drop-off Points",null,null,null,null,null,null,null,0,""]
["Waste Separation Facilities",null,null,null,null,null,null,null,0,""]
["Electricity Generation Facilities",null,null,null,null,null,null,null,0,""]
["Capital Spares",null,null,null,null,null,null,null,0,""]
["Rail Infrastructure",null,{"$f":"SUM(C54:C62)","v":0},0,0,0,0,0,0,"",{"$f":"SUM(K54:K62)","v":0}]
["Rail Lines",null,null,null,null,null,null,null,0,""]
["Rail Structures",null,null,null,null,null,null,null,0,""]
["Rail Furniture",null,null,null,null,null,null,null,0,""]
["Drainage Collection",null,null,null,null,null,null,null,0,""]
["Storm water Conveyance",null,null,null,null,null,null,null,0,""]
["Attenuation",null,null,null,null,null,null,null,0,""]
["MV Substations",null,null,null,null,null,null,null,0,""]
["LV Networks",null,null,null,null,null,null,null,0,""]
["Capital Spares",null,null,null,null,null,null,null,0,""]
["Coastal Infrastructure",null,{"$f":"SUM(C64:C68)","v":0},14206000,0,0,0,0,0,"",{"$f":"SUM(K64:K68)","v":0}]
["Sand Pumps",null,null,null,null,null,null,null,0,""]
["Piers",null,null,null,null,null,null,null,0,""]
["Revetments",null,null,null,null,null,null,null,0,""]
["Promenades",null,null,14206000,null,null,null,{"$f":"E67/12*8","v":0},0,"",{"$f":"E67","v":0}]
["Capital Spares",null,null,null,null,null,null,null,0,""]
["Information and Communication Infrastructure",null,{"$f":"SUM(C70:C73)","v":0},0,0,0,0,0,0,"",{"$f":"SUM(K70:K73)","v":0}]
["Data Centres",null,null,null,null,null,null,null,0,""]
["Core Layers",null,null,null,null,null,null,null,0,""]
["Distribution Layers",null,null,null,null,null,null,null,0,""]
["Capital Spares",null,null,null,null,null,null,null,0,""]
[null,null,null,null,null,null,null,null,null,""]
["Community Assets",null,{"$f":"+C76+C99","v":174579.05},8000000,0,0,0,0,0,"",{"$f":"+K76+K99","v":0}]
["Community Facilities",null,{"$f":"SUM(C77:C98)","v":174579.05},8000000,0,0,0,0,0,"",{"$f":"SUM(K77:K98)","v":0}]
["Halls",null,null,null,null,null,null,null,0,""]
["Centres",null,null,null,null,null,null,null,0,""]
["Crèches",null,null,null,null,null,null,null,0,""]
["Clinics/Care Centres",null,null,null,null,null,null,null,0,""]
["Fire/Ambulance Stations",null,null,null,null,null,null,null,0,""]
["Testing Stations",null,null,null,null,null,null,null,0,""]
["Museums",null,null,null,null,null,null,null,0,""]
["Galleries",null,null,null,null,null,null,null,0,""]
["Theatres",null,null,null,null,null,null,null,0,""]
["Libraries",null,null,null,null,null,null,null,0,""]
["Cemeteries/Crematoria",null,null,null,null,null,null,null,0,""]
["Police",null,null,null,null,null,null,null,0,""]
["Purls",null,null,null,null,null,null,null,0,""]
["Public Open Space",null,null,null,null,null,null,null,0,""]
["Nature Reserves",null,null,null,null,null,null,null,0,""]
["Public Ablution Facilities",null,null,null,null,null,null,null,0,""]
["Markets",null,174579.05,8000000,null,null,null,{"$f":"E93/12*8","v":0},0,"",{"$f":"E93","v":0}]
["Stalls",null,null,null,null,null,null,null,0,""]
["Abattoirs",null,null,null,null,null,null,null,0,""]
["Airports",null,null,null,null,null,null,null,0,""]
["Taxi Ranks/Bus Terminals",null,null,null,null,null,null,null,0,""]
["Capital Spares",null,null,null,null,null,null,null,0,""]
["Sport and Recreation Facilities",null,{"$f":"SUM(C100:C102)","v":0},0,0,0,0,0,0,"",{"$f":"SUM(K100:K102)","v":0}]
["Indoor Facilities",null,null,null,null,null,null,null,0,""]
["Outdoor Facilities",null,null,null,null,null,null,null,{"$f":"H101-G101","v":0},{"$f":"IF(I101=0,\"\",I101/H101)","v":""}]
["Capital Spares",null,null,null,null,null,null,null,0,""]
["Heritage assets",null,{"$f":"SUM(C104:C108)","v":0},0,0,0,0,0,0,"",{"$f":"SUM(K104:K108)","v":0}]
["Monuments",null,null,null,null,null,null,null,0,""]
["Historic Buildings",null,null,null,null,null,null,null,0,""]
["Works of Art",null,null,null,null,null,null,null,0,""]
["Conservation Areas",null,null,null,null,null,null,null,0,""]
["Other Heritage",null,null,null,null,null,null,null,0,""]
[null,null,null,null,null,null,null,null,0,""]
["Investment properties",null,{"$f":"+C111+C114","v":0},0,0,0,0,0,0,"",{"$f":"+K111+K114","v":0}]
["Revenue Generating",null,{"$f":"SUM(C112:C113)","v":0},0,0,0,0,0,0,"",{"$f":"SUM(K112:K113)","v":0}]
["Improved Property",null,null,null,null,null,null,null,0,""]
["Unimproved Property",null,null,null,null,null,null,null,0,""]
["Non-revenue Generating",null,{"$f":"SUM(C115:C116)","v":0},0,0,0,0,0,0,"",{"$f":"SUM(K115:K116)","v":0}]
["Improved Property",null,null,null,null,null,null,null,0,""]
["Unimproved Property",null,null,null,null,null,null,null,{"$f":"H116-G116","v":0},{"$f":"IF(I116=0,\"\",I116/H116)","v":""}]
["Other assets",null,{"$f":"+C118+C130","v":130000},0,7468472.5800000001,0,6886581.1300000008,6846099.8649999993,-40481.265000001527,-5.9130403877042381E-3,{"$f":"+K118+K130","v":7468472.5800000001}]
["Operational Buildings",null,{"$f":"SUM(C119:C129)","v":130000},0,7468472.5800000001,0,6886581.1300000008,6846099.8649999993,-40481.265000001527,-5.9130403877042381E-3,{"$f":"SUM(K119:K129)","v":7468472.5800000001}]
["Municipal Offices",null,130000,null,7468472.5800000001,null,6886581.1300000008,{"$f":"E119/12*11","v":6846099.8649999993},-40481.265000001527,-5.9130403877042381E-3,{"$f":"E119","v":7468472.5800000001}]
["Pay/Enquiry Points",null,null,null,null,null,null,null,0,""]
["Building Plan Offices",null,null,null,null,null,null,null,0,""]
["Workshops",null,null,null,null,null,null,null,0,""]
["Yards",null,null,null,null,null,null,null,0,""]
["Stores",null,null,null,null,null,null,null,0,""]
["Laboratories",null,null,null,null,null,null,null,0,""]
["Training Centres",null,null,null,null,null,null,null,0,""]
["Manufacturing Plant",null,null,null,null,null,null,null,0,""]
["Depots",null,null,null,null,null,null,null,0,""]
["Capital Spares",null,null,null,null,null,null,null,0,""]
["Housing",null,{"$f":"SUM(C131:C133)","v":0},0,0,0,0,0,0,"",{"$f":"SUM(K131:K133)","v":0}]
["Staff Housing",null,null,null,null,null,null,null,0,""]
["Social Housing",null,null,null,null,null,null,null,0,""]
["Capital Spares",null,null,null,null,null,null,null,0,""]
[null,null,null,null,null,null,null,null,null,""]
["Biological or Cultivated Assets",null,{"$f":"SUM(C136:C136)","v":0},0,0,0,0,0,{"$f":"H135-G135","v":0},"",{"$f":"SUM(K136)","v":0}]
["Biological or Cultivated Assets",null,null,null,null,null,null,null,{"$f":"H136-G136","v":0},""]
[null,null,null,null,null,null,null,null,null,{"$f":"IF(I137=0,\"\",I137/H137)","v":""}]
["Intangible Assets",null,{"$f":"SUM(C139:C140)","v":0},0,0,0,0,0,{"$f":"H138-G138","v":0},"",{"$f":"SUM(K139:K140)","v":0}]
["Servitudes",null,null,null,null,null,null,null,0,""]
["Licences and Rights",null,{"$f":"SUM(C141:C146)","v":0},0,0,0,0,0,0,"",{"$f":"SUM(K141:K146)","v":0}]
["Water Rights",null,null,null,null,null,null,null,0,""]
["Effluent Licenses",null,null,null,null,null,null,null,0,""]
["Solid Waste Licenses",null,null,null,null,null,null,null,0,""]
["Computer Software and Applications",null,null,null,null,null,null,null,0,""]
["Load Settlement Software Applications",null,null,null,null,null,null,null,0,""]
["Unspecified",null,null,null,null,null,null,null,0,""]
[]
["Computer Equipment",null,{"$f":"SUM(C149:C149)","v":0},0,0,0,0,0,{"$f":"H148-G148","v":0},{"$f":"IF(I148=0,\"\",I148/H148)","v":""},{"$f":"SUM(K149)","v":0}]
["Computer Equipment",null,null,null,null,null,null,null,{"$f":"H149-G149","v":0},{"$f":"IF(I149=0,\"\",I149/H149)","v":""}]
[]
["Furniture and Office Equipment",null,{"$f":"SUM(C152:C152)","v":0},0,0,0,0,0,{"$f":"H151-G151","v":0},{"$f":"IF(I151=0,\"\",I151/H151)","v":""},{"$f":"SUM(K152)","v":0}]
["Furniture and Office Equipment",null,null,null,null,null,null,null,{"$f":"H152-G152","v":0},{"$f":"IF(I152=0,\"\",I152/H152)","v":""}]
[null,null,null,null,null,null,null,null,null,{"$f":"IF(I153=0,\"\",I153/H153)","v":""}]
["Machinery and Equipment",null,{"$f":"SUM(C155:C155)","v":0},0,0,0,0,0,{"$f":"H154-G154","v":0},{"$f":"IF(I154=0,\"\",I154/H154)","v":""},{"$f":"SUM(K155)","v":0}]
["Machinery and Equipment",null,null,null,null,null,null,null,{"$f":"H155-G155","v":0},{"$f":"IF(I155=0,\"\",I155/H155)","v":""}]
[]
["Transport Assets",null,{"$f":"SUM(C158:C158)","v":0},0,0,0,0,0,{"$f":"H157-G157","v":0},{"$f":"IF(I157=0,\"\",I157/H157)","v":""},{"$f":"SUM(K158)","v":0}]
["Transport Assets",null,null,null,null,null,null,null,{"$f":"H158-G158","v":0},{"$f":"IF(I158=0,\"\",I158/H158)","v":""}]
[]
["Land",null,{"$f":"SUM(C161:C161)","v":0},0,0,0,0,0,{"$f":"H160-G160","v":0},{"$f":"IF(I160=0,\"\",I160/H160)","v":""},{"$f":"SUM(K161)","v":0}]
["Land",null,null,null,null,null,null,null,{"$f":"H161-G161","v":0},{"$f":"IF(I161=0,\"\",I161/H161)","v":""}]
[null,null,null,null,null,null,null,null,null,"."]
["Zoo's, Marine and Non-biological Animals",null,{"$f":"SUM(C164:C164)","v":0},0,0,0,0,0,{"$f":"H163-G163","v":0},{"$f":"IF(I163=0,\"\",I163/H163)","v":""},{"$f":"SUM(K164)","v":0}]
["Zoo's, Marine and Non-biological Animals",null,null,null,null,null,null,null,{"$f":"H164-G164","v":0},{"$f":"IF(I164=0,\"\",I164/H164)","v":""}]
[]
["Living resources",null,{"$f":"+C167+C170","v":0},0,0,0,0,0,{"$f":"H166-G166","v":0},{"$f":"IF(I166=0,\"\",I166/H166)","v":""},{"$f":"+K167+K170","v":0}]
["Mature",null,{"$f":"+C168+C169","v":0},0,0,0,0,0,0,"",{"$f":"+K168+K169","v":0}]
["Policing and Protection",null,null,null,null,null,null,null,0,""]
["Zoological plants and animals",null,null,null,null,null,null,null,0,""]
["Immature",null,{"$f":"+C171+C172","v":0},0,0,0,0,0,0,"",{"$f":"+K171+K172","v":0}]
["Policing and Protection",null,null,null,null,null,null,null,0,""]
["Zoological plants and animals",null,null,null,null,null,null,null,0,""]
["Total Capital Expenditure on renewal of existing assets",1,{"$f":"C7+C75+C103+C110+C117+C135+C138+C148+C151+C154+C157+C160+C163+C166","v":115855239.18999998},55356000,34508472.579999998,17768736.079999998,88680778.450000003,31632766.531666666,{"$f":"H173-G173","v":-57048011.918333337},{"$f":"IF(I173=0,\"\",I173/H173)","v":-1.8034468108005726},{"$f":"K7+K75+K103+K110+K117+K135+K138+K148+K151+K154+K157+K160+K163+K166","v":34508472.579999998}]
[]
[{"$f":"head27a","v":"References"}]
["1. Total Capital Expenditure on new assets (SC13a) plus Total Capital Expenditure on renewal of existing assets (SC13b) plus Total Capital Expenditure on upgrading of existing assets (SC13e) must reconcile to total capital expenditure in Table C5"]
[]
["check balance",null,{"$f":"C173+SC13a!C173+SC13e!C173-'C5-Capex'!C40","v":0},{"$f":"D173+SC13a!D173+SC13e!D173-'C5-Capex'!D40","v":0},{"$f":"E173+SC13a!E173+SC13e!E173-'C5-Capex'!E40","v":0},{"$f":"F173+SC13a!F173+SC13e!F173-'C5-Capex'!F40","v":0},{"$f":"G173+SC13a!G173+SC13e!G173-'C5-Capex'!G40","v":0},0,null,null,{"$f":"K173+SC13a!K173+SC13e!K173-'C5-Capex'!K40","v":0}]

{"sheet":"SC13c","index":31,"n_rows":173,"n_cols":11,"rows_kept":173,"cut":false,"hidden":false,"merged":[[0,0,0,10],[1,0,2,0],[1,1,2,1]]}
[{"$f":"muni& \" - \"&S71Sc& \" - \"&Head57","v":"KZN225 Msunduzi - Supporting Table SC13c Consolidated Monthly Budget Statement - expenditure on repairs and maintenance by asset class - M11 May"}]
[{"$f":"desc","v":"Description"},{"$f":"head27","v":"Ref"},{"$f":"Head1","v":"2022/23"},{"$f":"Head2","v":"Budget Year 2023/24"}]
[null,null,{"$f":"Head5","v":"Audited Outcome"},{"$f":"Head6","v":"Original Budget"},{"$f":"Head7","v":"Adjusted Budget"},{"$f":"Head38","v":"Monthly actual"},{"$f":"Head39","v":"YearTD actual"},"YearTD budget",{"$f":"Head41","v":"YTD variance"},{"$f":"Head41","v":"YTD variance"},{"$f":"Head8","v":"Full Year Forecast"}]
["R thousands",1,null,null,null,null,null,null,null,"%"]
["Repairs and maintenance expenditure by Asset Class/Sub-class"]
[]
["Infrastructure",null,{"$f":"C8+C13+C17+C27+C38+C45+C53+C63+C69","v":76159436.080000013},169862603.09999999,253004616.5,19422635.559999999,95266604.569999978,231920898.45833331,{"$f":"H7-G7","v":136654293.88833332},{"$f":"IF(I7=0,\"\",I7/H7)","v":0.58922802902509663},{"$f":"K8+K13+K17+K27+K38+K45+K53+K63+K69","v":253004616.5}]
["Roads Infrastructure",null,{"$f":"SUM(C9:C12)","v":0},0,0,0,0,0,0,"",{"$f":"SUM(K9:K12)","v":0}]
["Roads",null,null,null,null,null,null,null,0,""]
["Road Structures",null,null,null,null,null,null,null,0,""]
["Road Furniture",null,null,null,null,null,null,null,0,""]
["Capital Spares",null,null,null,null,null,null,null,0,""]
["Storm water Infrastructure",null,{"$f":"SUM(C14:C16)","v":0},0,0,0,0,0,0,"",{"$f":"SUM(K14:K16)","v":0}]
["Drainage Collection",null,null,null,null,null,null,null,0,""]
["Storm water Conveyance",null,null,null,null,null,null,null,0,""]
["Attenuation",null,null,null,null,null,null,null,0,""]
["Electrical Infrastructure",null,{"$f":"SUM(C18:C26)","v":63198838.100000009},161182203.09999999,238825679.25999999,15763954.839999998,82977828.039999977,218923539.32166666,135945711.2816667,0.62097347641507039,{"$f":"SUM(K18:K26)","v":238825679.25999999}]
["Power Plants",null,63198838.100000009,161182203.09999999,238825679.25999999,15763954.839999998,82977828.039999977,{"$f":"E18/12*11","v":218923539.32166666},135945711.2816667,0.62097347641507039,{"$f":"E18","v":238825679.25999999}]
["HV Substations",null,null,null,null,null,null,null,0,""]
["HV Switching Station",null,null,null,null,null,null,null,0,""]
["HV Transmission Conductors",null,null,null,null,null,null,null,0,""]
["MV Substations",null,null,null,null,null,null,null,0,""]
["MV Switching Stations",null,null,null,null,null,null,null,0,""]
["MV Networks",null,null,null,null,null,null,null,0,""]
["LV Networks",null,null,null,null,null,null,null,0,""]
["Capital Spares",null,null,null,null,null,null,null,0,""]
["Water Supply Infrastructure",null,{"$f":"SUM(C28:C37)","v":0},0,0,0,0,0,0,"",{"$f":"SUM(K28:K37)","v":0}]
["Dams and Weirs",null,null,null,null,null,null,null,0,""]
["Boreholes",null,null,null,null,null,null,null,0,""]
["Reservoirs",null,null,null,null,null,null,{"$f":"D30/12*7","v":0},0,"",{"$f":"D30","v":0}]
["Pump Stations",null,null,null,null,null,null,null,0,""]
["Water Treatment Works",null,null,null,null,null,null,null,0,""]
["Bulk Mains",null,null,null,null,null,null,null,0,""]
["Distribution",null,null,null,null,null,null,null,0,""]
["Distribution Points",null,null,null,null,null,null,null,0,""]
["PRV Stations",null,null,null,null,null,null,null,0,""]
["Capital Spares",null,null,null,null,null,null,null,0,""]
["Sanitation Infrastructure",null,{"$f":"SUM(C39:C44)","v":12960597.98},8680400,14178937.239999998,3658680.7199999997,12288776.530000001,12997359.136666667,708582.60666666552,5.4517429211269015E-2,{"$f":"SUM(K39:K44)","v":14178937.239999998}]
["Pump Station",null,null,null,null,null,null,null,0,""]
["Reticulation",null,12960597.98,8680400,14178937.239999998,3658680.7199999997,12288776.530000001,{"$f":"E40/12*11","v":12997359.136666667},708582.60666666552,5.4517429211269015E-2,{"$f":"E40","v":14178937.239999998}]
["Waste Water Treatment Works",null,null,null,null,null,null,null,0,""]
["Outfall Sewers",null,null,null,null,null,null,null,0,""]
["Toilet Facilities",null,null,null,null,null,null,null,0,""]
["Capital Spares",null,null,null,null,null,null,null,0,""]
["Solid Waste Infrastructure",null,{"$f":"SUM(C46:C52)","v":0},0,0,0,0,0,0,"",{"$f":"SUM(K46:K52)","v":0}]
["Landfill Sites",null,null,null,null,null,null,null,0,""]
["Waste Transfer Stations",null,null,null,null,null,null,null,0,""]
["Waste Processing Facilities",null,null,null,null,null,null,null,0,""]
["Waste Drop-off Points",null,null,null,null,null,null,null,0,""]
["Waste Separation Facilities",null,null,null,null,null,null,null,0,""]
["Electricity Generation Facilities",null,null,null,null,null,null,null,0,""]
["Capital Spares",null,null,null,null,null,null,null,0,""]
["Rail Infrastructure",null,{"$f":"SUM(C54:C62)","v":0},0,0,0,0,0,0,"",{"$f":"SUM(K54:K62)","v":0}]
["Rail Lines",null,null,null,null,null,null,null,0,""]
["Rail Structures",null,null,null,null,null,null,null,0,""]
["Rail Furniture",null,null,null,null,null,null,null,0,""]
["Drainage Collection",null,null,null,null,null,null,null,0,""]
["Storm water Conveyance",null,null,null,null,null,null,null,0,""]
["Attenuation",null,null,null,null,null,null,null,0,""]
["MV Substations",null,null,null,null,null,null,null,0,""]
["LV Networks",null,null,null,null,null,null,null,0,""]
["Capital Spares",null,null,null,null,null,null,null,0,""]
["Coastal Infrastructure",null,{"$f":"SUM(C64:C68)","v":0},0,0,0,0,0,0,"",{"$f":"SUM(K64:K68)","v":0}]
["Sand Pumps",null,null,null,null,null,null,null,0,""]
["Piers",null,null,null,null,null,null,null,0,""]
["Revetments",null,null,null,null,null,null,null,0,""]
["Promenades",null,null,null,null,null,null,null,0,""]
["Capital Spares",null,null,null,null,null,null,null,0,""]
["Information and Communication Infrastructure",null,{"$f":"SUM(C70:C73)","v":0},0,0,0,0,0,0,"",{"$f":"SUM(K70:K73)","v":0}]
["Data Centres",null,null,null,null,null,null,null,0,""]
["Core Layers",null,null,null,null,null,null,null,0,""]
["Distribution Layers",null,null,null,null,null,null,null,0,""]
["Capital Spares",null,null,null,null,null,null,null,0,""]
[null,null,null,null,null,null,null,null,null,""]
["Community Assets",null,{"$f":"+C76+C99","v":0},15000,5764,0,0,5283.6666666666661,5283.6666666666661,1,{"$f":"+K76+K99","v":5764}]
["Community Facilities",null,{"$f":"SUM(C77:C98)","v":0},15000,5764,0,0,5283.6666666666661,5283.6666666666661,1,{"$f":"SUM(K77:K98)","v":5764}]
["Halls",null,null,15000,null,null,null,{"$f":"E77/12*8","v":0},0,"",{"$f":"E77","v":0}]
["Centres",null,null,null,null,null,null,null,0,""]
["Crèches",null,null,null,null,null,null,null,0,""]
["Clinics/Care Centres",null,null,null,null,null,null,null,0,""]
["Fire/Ambulance Stations",null,null,null,null,null,null,null,0,""]
["Testing Stations",null,null,null,null,null,null,null,0,""]
["Museums",null,null,null,null,null,null,null,0,""]
["Galleries",null,null,null,null,null,null,null,0,""]
["Theatres",null,null,null,null,null,null,null,0,""]
["Libraries",null,null,null,null,null,null,null,0,""]
["Cemeteries/Crematoria",null,null,null,null,null,null,null,0,""]
["Police",null,null,null,null,null,null,null,0,""]
["Purls",null,null,null,null,null,null,null,0,""]
["Public Open Space",null,null,null,null,null,null,null,0,""]
["Nature Reserves",null,null,null,null,null,null,null,0,""]
["Public Ablution Facilities",null,null,null,null,null,null,null,0,""]
["Markets",null,null,null,5764,null,null,{"$f":"E93/12*11","v":5283.6666666666661},5283.6666666666661,1,{"$f":"E93","v":5764}]
["Stalls",null,null,null,null,null,null,null,0,""]
["Abattoirs",null,null,null,null,null,null,null,0,""]
["Airports",null,null,null,null,null,null,null,0,""]
["Taxi Ranks/Bus Terminals",null,null,null,null,null,null,null,0,""]
["Capital Spares",null,null,null,null,null,null,null,0,""]
["Sport and Recreation Facilities",null,{"$f":"SUM(C100:C102)","v":0},0,0,0,0,0,0,"",{"$f":"SUM(K100:K102)","v":0}]
["Indoor Facilities",null,null,null,null,null,null,null,0,""]
["Outdoor Facilities",null,null,null,null,null,null,null,{"$f":"H101-G101","v":0},{"$f":"IF(I101=0,\"\",I101/H101)","v":""}]
["Capital Spares",null,null,null,null,null,null,null,0,""]
["Heritage assets",null,{"$f":"SUM(C104:C108)","v":0},0,0,0,0,0,0,"",{"$f":"SUM(K104:K108)","v":0}]
["Monuments",null,null,null,null,null,null,null,0,""]
["Historic Buildings",null,null,null,null,null,null,null,0,""]
["Works of Art",null,null,null,null,null,null,null,0,""]
["Conservation Areas",null,null,null,null,null,null,null,0,""]
["Other Heritage",null,null,null,null,null,null,null,0,""]
[null,null,null,null,null,null,null,null,0,""]
["Investment properties",null,{"$f":"+C111+C114","v":0},0,0,0,0,0,0,"",{"$f":"+K111+K114","v":0}]
["Revenue Generating",null,{"$f":"SUM(C112:C113)","v":0},0,0,0,0,0,0,"",{"$f":"SUM(K112:K113)","v":0}]
["Improved Property",null,null,null,null,null,null,null,0,""]
["Unimproved Property",null,null,null,null,null,null,null,0,""]
["Non-revenue Generating",null,{"$f":"SUM(C115:C116)","v":0},0,0,0,0,0,0,"",{"$f":"SUM(K115:K116)","v":0}]
["Improved Property",null,null,null,null,null,null,null,0,""]
["Unimproved Property",null,null,null,null,null,null,null,{"$f":"H116-G116","v":0},{"$f":"IF(I116=0,\"\",I116/H116)","v":""}]
["Other assets",null,{"$f":"+C118+C130","v":51284449.800000012},163462034.55919999,107992162.80000001,5603902.120000001,97468260.580000013,98992815.899999991,1524555.3199999779,1.5400666261883536E-2,{"$f":"+K118+K130","v":107992162.80000001}]
["Operational Buildings",null,{"$f":"SUM(C119:C129)","v":51284449.800000012},163462034.55919999,107992162.80000001,5603902.120000001,97468260.580000013,{"$f":"SUM(H119:H129)","v":98992815.899999991},1524555.3199999779,1.5400666261883536E-2,{"$f":"SUM(K119:K129)","v":107992162.80000001}]
["Municipal Offices",null,16790067.630000014,50406689.059200004,77367364.040000007,1154736.4300000002,11816948.449999999,{"$f":"E119/12*11","v":70920083.703333333},59103135.25333333,0.83337655805044419,{"$f":"E119","v":77367364.040000007}]
["Pay/Enquiry Points",null,null,null,null,null,null,null,0,""]
["Building Plan Offices",null,null,null,null,null,null,null,0,""]
["Workshops",null,34494382.170000002,null,null,null,null,null,0,""]
["Yards",null,null,null,null,null,null,null,0,""]
["Stores",null,null,113055345.5,30624798.759999998,4449165.6900000004,85651312.13000001,{"$f":"E124/12*11","v":28072732.196666662},-57578579.933333352,-2.0510500912401466,{"$f":"E124","v":30624798.759999998}]
["Laboratories",null,null,null,null,null,null,null,0,""]
["Training Centres",null,null,null,null,null,null,null,0,""]
["Manufacturing Plant",null,null,null,null,null,null,null,0,""]
["Depots",null,null,null,null,null,null,null,0,""]
["Capital Spares",null,null,null,null,null,null,null,0,""]
["Housing",null,{"$f":"SUM(C131:C133)","v":0},0,0,0,0,0,0,"",{"$f":"SUM(K131:K133)","v":0}]
["Staff Housing",null,null,null,null,null,null,null,0,""]
["Social Housing",null,null,null,null,null,null,null,0,""]
["Capital Spares",null,null,null,null,null,null,null,0,""]
[null,null,null,null,null,null,null,null,null,""]
["Biological or Cultivated Assets",null,{"$f":"SUM(C136:C136)","v":0},0,0,0,0,0,{"$f":"H135-G135","v":0},"",{"$f":"SUM(K136)","v":0}]
["Biological or Cultivated Assets",null,null,null,null,null,null,null,{"$f":"H136-G136","v":0},""]
[null,null,null,null,null,null,null,null,null,""]
["Intangible Assets",null,{"$f":"SUM(C139:C140)","v":0},0,0,0,0,0,{"$f":"H138-G138","v":0},"",{"$f":"SUM(K139:K140)","v":0}]
["Servitudes",null,null,null,null,null,null,null,0,""]
["Licences and Rights",null,{"$f":"SUM(C141:C146)","v":0},0,0,0,0,0,0,"",{"$f":"SUM(K141:K146)","v":0}]
["Water Rights",null,null,null,null,null,null,null,0,""]
["Effluent Licenses",null,null,null,null,null,null,null,0,""]
["Solid Waste Licenses",null,null,null,null,null,null,null,0,""]
["Computer Software and Applications",null,null,null,null,null,null,null,0,""]
["Load Settlement Software Applications",null,null,null,null,null,null,null,0,""]
["Unspecified",null,null,null,null,null,null,null,0,""]
[]
["Computer Equipment",null,{"$f":"SUM(C149:C149)","v":0},0,0,0,0,0,{"$f":"H148-G148","v":0},{"$f":"IF(I148=0,\"\",I148/H148)","v":""},{"$f":"SUM(K149)","v":0}]
["Computer Equipment",null,null,null,null,null,null,null,{"$f":"H149-G149","v":0},{"$f":"IF(I149=0,\"\",I149/H149)","v":""}]
[]
["Furniture and Office Equipment",null,{"$f":"SUM(C152:C152)","v":0},0,0,0,0,0,{"$f":"H151-G151","v":0},{"$f":"IF(I151=0,\"\",I151/H151)","v":""},{"$f":"SUM(K152)","v":0}]
["Furniture and Office Equipment",null,null,null,null,null,null,null,{"$f":"H152-G152","v":0},{"$f":"IF(I152=0,\"\",I152/H152)","v":""}]
[null,null,null,null,null,null,null,null,null,{"$f":"IF(I153=0,\"\",I153/H153)","v":""}]
["Machinery and Equipment",null,{"$f":"SUM(C155:C155)","v":103573207.83999997},214841689.52936003,98807022.339999974,16126862.739999998,85685638.009999976,90573103.811666653,{"$f":"H154-G154","v":4887465.801666677},{"$f":"IF(I154=0,\"\",I154/H154)","v":5.3961558078316915E-2},{"$f":"SUM(K155)","v":98807022.339999974}]
["Machinery and Equipment",null,103573207.83999997,214841689.52936003,98807022.339999974,16126862.739999998,85685638.009999976,{"$f":"E155/12*11","v":90573103.811666653},{"$f":"H155-G155","v":4887465.801666677},{"$f":"IF(I155=0,\"\",I155/H155)","v":5.3961558078316915E-2},{"$f":"E155","v":98807022.339999974}]
[]
["Transport Assets",null,{"$f":"SUM(C158:C158)","v":20669583.279999997},25105149,25546556.660000004,2632109.3600000003,20298622.640000004,23417676.93833334,{"$f":"H157-G157","v":3119054.2983333357},{"$f":"IF(I157=0,\"\",I157/H157)","v":0.13319230197542054},{"$f":"SUM(K158)","v":25546556.660000004}]
["Transport Assets",null,20669583.279999997,25105149,25546556.660000004,2632109.3600000003,20298622.640000004,{"$f":"E158/12*11","v":23417676.93833334},{"$f":"H158-G158","v":3119054.2983333357},{"$f":"IF(I158=0,\"\",I158/H158)","v":0.13319230197542054},{"$f":"E158","v":25546556.660000004}]
[]
["Land",null,{"$f":"SUM(C161:C161)","v":0},0,0,0,0,0,{"$f":"H160-G160","v":0},{"$f":"IF(I160=0,\"\",I160/H160)","v":""},{"$f":"SUM(K161)","v":0}]
["Land",null,null,null,null,null,null,null,{"$f":"H161-G161","v":0},{"$f":"IF(I161=0,\"\",I161/H161)","v":""}]
[]
["Zoo's, Marine and Non-biological Animals",null,{"$f":"SUM(C164:C164)","v":0},0,0,0,0,0,{"$f":"H163-G163","v":0},{"$f":"IF(I163=0,\"\",I163/H163)","v":""},{"$f":"SUM(K164)","v":0}]
["Zoo's, Marine and Non-biological Animals",null,null,null,null,null,null,null,{"$f":"H164-G164","v":0},{"$f":"IF(I164=0,\"\",I164/H164)","v":""}]
[]
["Living resources",null,{"$f":"+C167+C170","v":0},0,0,0,0,0,{"$f":"H166-G166","v":0},{"$f":"IF(I166=0,\"\",I166/H166)","v":""},{"$f":"+K167+K170","v":0}]
["Mature",null,{"$f":"+C168+C169","v":0},0,0,0,0,0,0,"",{"$f":"+K168+K169","v":0}]
["Policing and Protection",null,null,null,null,null,null,null,0,""]
["Zoological plants and animals",null,null,null,null,null,null,null,0,""]
["Immature",null,{"$f":"+C171+C172","v":0},0,0,0,0,0,0,"",{"$f":"+K171+K172","v":0}]
["Policing and Protection",null,null,null,null,null,null,null,0,""]
["Zoological plants and animals",null,null,null,null,null,null,null,0,""]
["Total Repairs and Maintenance Expenditure",1,{"$f":"C7+C75+C103+C110+C117+C135+C138+C148+C151+C154+C157+C160+C163+C166","v":251686677},573286476.18856001,485356122.30000001,43785509.780000001,298719125.79999995,444909778.77499998,{"$f":"H173-G173","v":146190652.97500002},{"$f":"IF(I173=0,\"\",I173/H173)","v":0.32858494002428218},{"$f":"K7+K75+K103+K110+K117+K135+K138+K148+K151+K154+K157+K160+K163+K166","v":485356122.30000001}]

{"sheet":"SC13d","index":32,"n_rows":173,"n_cols":11,"rows_kept":173,"cut":false,"hidden":false,"merged":[[0,0,0,10],[1,0,2,0],[1,1,2,1]]}
[{"$f":"muni& \" - \"&S71Sd& \" - \"&Head57","v":"KZN225 Msunduzi - Supporting Table SC13d Consolidated Monthly Budget Statement - depreciation by asset class - M11 May"}]
[{"$f":"desc","v":"Description"},{"$f":"head27","v":"Ref"},{"$f":"Head1","v":"2022/23"},{"$f":"Head2","v":"Budget Year 2023/24"}]
[null,null,{"$f":"Head5","v":"Audited Outcome"},{"$f":"Head6","v":"Original Budget"},{"$f":"Head7","v":"Adjusted Budget"},{"$f":"Head38","v":"Monthly actual"},{"$f":"Head39","v":"YearTD actual"},"YearTD budget",{"$f":"Head41","v":"YTD variance"},{"$f":"Head41","v":"YTD variance"},{"$f":"Head8","v":"Full Year Forecast"}]
["R thousands",1,null,null,null,null,null,null,null,"%"]
["Depreciation by Asset Class/Sub-class"]
[]
["Infrastructure",null,{"$f":"C8+C13+C17+C27+C38+C45+C53+C63+C69","v":268177320.84199989},342269027.62910002,342269027.63155001,24432417.02,260004830.42999995,311840576.21142077,{"$f":"H7-G7","v":51835745.781420827},{"$f":"IF(I7=0,\"\",I7/H7)","v":0.16622514751344411},{"$f":"K8+K13+K17+K27+K38+K45+K53+K63+K69","v":342269027.63155001}]
["Roads Infrastructure",null,{"$f":"SUM(C9:C12)","v":82419928.409999967},119425760.13224998,119425760.13224998,7496490.7900000019,80248508.059999987,109473613.45456247,29225105.394562483,0.26696026989821159,{"$f":"SUM(K9:K12)","v":119425760.13224998}]
["Roads",null,82419928.409999967,119425760.13224998,119425760.13224998,7496490.7900000019,80248508.059999987,{"$f":"E9/12*11","v":109473613.45456247},29225105.394562483,0.26696026989821159,{"$f":"E9","v":119425760.13224998}]
["Road Structures",null,null,null,null,null,null,null,0,""]
["Road Furniture",null,null,null,null,null,null,null,0,""]
["Capital Spares",null,null,null,null,null,null,null,0,""]
["Storm water Infrastructure",null,{"$f":"SUM(C14:C16)","v":0},0,0,0,0,0,0,"",{"$f":"SUM(K14:K16)","v":0}]
["Drainage Collection",null,null,null,null,null,null,null,0,""]
["Storm water Conveyance",null,null,null,null,null,null,null,0,""]
["Attenuation",null,null,null,null,null,null,null,0,""]
["Electrical Infrastructure",null,{"$f":"SUM(C18:C26)","v":93050044.345999941},104984887.70164998,104984887.70164998,8283507.3499999996,89246415.429999977,96236147.059845835,6989731.6298458576,7.2631041904651403E-2,{"$f":"SUM(K18:K26)","v":104984887.70164998}]
["Power Plants",null,0,null,0,null,null,null,0,""]
["HV Substations",null,33275409.660000004,38685433.282099999,38685433.282099999,3437737.8899999997,36996982.170000002,{"$f":"E19/12*11","v":35461647.175258331},-1535334.9947416708,-4.3295648032189472E-2,{"$f":"E19","v":38685433.282099999}]
["HV Switching Station",null,4308781.8900000006,5218688.9837499997,5218688.9837499997,367433.99999999994,3979337.34,4783798.235104166,804460.89510416612,0.16816363390933212,5218688.9837499997]
["HV Transmission Conductors",null,53687534.575999938,58677373.060349986,58677373.060349986,4319244.45,46605537.099999987,53787591.971987493,7182054.8719875067,0.13352623920639375,58677373.060349986]
["MV Substations",null,0,0,0,0,0,null,0,""]
["MV Switching Stations",null,0,0,0,null,null,null,0,""]
["MV Networks",null,0,0,0,null,null,null,0,""]
["LV Networks",null,1778318.22,2403392.3754499997,2403392.3754499997,159091.00999999998,1664558.8200000003,{"$f":"E25/12*11","v":2203109.677495833},538550.85749583272,0.24445031629472808,{"$f":"E25","v":2403392.3754499997}]
["Capital Spares",null,0,0,0,null,null,null,0,""]
["Water Supply Infrastructure",null,{"$f":"SUM(C28:C37)","v":72446061.035999939},81811183.128400013,93350338.580000013,6515548.0000000009,67757600.270000011,85571143.698333353,17813543.428333342,0.20817231906040648,{"$f":"SUM(K28:K37)","v":93350338.580000013}]
["Dams and Weirs",null,null,null,null,null,null,null,0,""]
["Boreholes",null,null,null,null,null,null,null,0,""]
["Reservoirs",null,null,null,null,null,null,null,0,""]
["Pump Stations",null,null,null,null,null,null,null,0,""]
["Water Treatment Works",null,null,null,null,null,null,null,0,""]
["Bulk Mains",null,null,null,null,null,null,null,0,""]
["Distribution",null,72446061.035999939,81811183.128400013,93350338.580000013,6515548.0000000009,67757600.270000011,{"$f":"E34/12*11","v":85571143.698333353},17813543.428333342,0.20817231906040648,{"$f":"E34","v":93350338.580000013}]
["Distribution Points",null,null,null,null,null,null,null,0,""]
["PRV Stations",null,null,null,null,null,null,null,0,""]
["Capital Spares",null,null,null,null,null,null,null,0,""]
["Sanitation Infrastructure",null,{"$f":"SUM(C39:C44)","v":21297547.290000003},34418266.759800002,22872389.41,1998864.2100000002,21256492.490000002,19060324.508333333,-2196167.9816666692,-0.1152219617617993,{"$f":"SUM(K39:K44)","v":22872389.41}]
["Pump Station",null,null,null,null,null,null,null,0,""]
["Reticulation",null,null,null,null,null,null,null,0,""]
["Waste Water Treatment Works",null,21297547.290000003,34418266.759800002,22872389.41,1998864.2100000002,21256492.490000002,{"$f":"E41/12*10","v":19060324.508333333},-2196167.9816666692,-0.1152219617617993,{"$f":"E41","v":22872389.41}]
["Outfall Sewers",null,null,null,null,null,null,null,0,""]
["Toilet Facilities",null,null,null,null,null,null,null,0,""]
["Capital Spares",null,null,null,null,null,null,null,0,""]
["Solid Waste Infrastructure",null,{"$f":"SUM(C46:C52)","v":-1150162.69},1498016.3093499998,1504738.21,128359.18000000001,1391247.9800000004,1379343.3591666666,-11904.620833333815,-8.630643526297917E-3,{"$f":"SUM(K46:K52)","v":1504738.21}]
["Landfill Sites",null,-1150162.69,1498016.3093499998,1504738.21,128359.18000000001,1391247.9800000004,{"$f":"E46/12*11","v":1379343.3591666666},-11904.620833333815,-8.630643526297917E-3,{"$f":"E46","v":1504738.21}]
["Waste Transfer Stations",null,null,null,null,null,null,null,0,""]
["Waste Processing Facilities",null,null,null,null,null,null,null,0,""]
["Waste Drop-off Points",null,null,null,null,null,null,null,0,""]
["Waste Separation Facilities",null,null,null,null,null,null,null,0,""]
["Electricity Generation Facilities",null,null,null,null,null,null,null,0,""]
["Capital Spares",null,null,null,null,null,null,null,0,""]
["Rail Infrastructure",null,{"$f":"SUM(C54:C62)","v":113902.44999999998},130913.59765,130913.59765,9647.49,104566.20000000001,120004.13117916667,15437.931179166655,0.1286449976969356,{"$f":"SUM(K54:K62)","v":130913.59765}]
["Rail Lines",null,113902.44999999998,130913.59765,130913.59765,9647.49,104566.20000000001,{"$f":"E54/12*11","v":120004.13117916667},15437.931179166655,0.1286449976969356,{"$f":"E54","v":130913.59765}]
["Rail Structures",null,null,null,null,null,null,null,0,""]
["Rail Furniture",null,null,null,null,null,null,null,0,""]
["Drainage Collection",null,null,null,null,null,null,null,0,""]
["Storm water Conveyance",null,null,null,null,null,null,null,0,""]
["Attenuation",null,null,null,null,null,null,null,0,""]
["MV Substations",null,null,null,null,null,null,null,0,""]
["LV Networks",null,null,null,null,null,null,null,0,""]
["Capital Spares",null,null,null,null,null,null,null,0,""]
["Coastal Infrastructure",null,{"$f":"SUM(C64:C68)","v":0},0,0,0,0,0,0,"",{"$f":"SUM(K64:K68)","v":0}]
["Sand Pumps",null,null,null,null,null,null,null,0,""]
["Piers",null,null,null,null,null,null,null,0,""]
["Revetments",null,null,null,null,null,null,null,0,""]
["Promenades",null,null,null,null,null,null,null,0,""]
["Capital Spares",null,null,null,null,null,null,null,0,""]
["Information and Communication Infrastructure",null,{"$f":"SUM(C70:C73)","v":0},0,0,0,0,0,0,"",{"$f":"SUM(K70:K73)","v":0}]
["Data Centres",null,null,null,null,null,null,null,0,""]
["Core Layers",null,null,null,null,null,null,null,0,""]
["Distribution Layers",null,null,null,null,null,null,null,0,""]
["Capital Spares",null,null,null,null,null,null,null,0,""]
[null,null,null,null,null,null,null,null,null,""]
["Community Assets",null,{"$f":"+C76+C99","v":27177251.745999936},33383812.774399996,32830901.054650001,2079008.0999999999,22516395.669999998,30094992.633429162,7578596.9634291641,0.25182252262826438,{"$f":"+K76+K99","v":32830901.054650001}]
["Community Facilities",null,{"$f":"SUM(C77:C98)","v":13541940.540000003},18528459.099149998,18104208.524650004,1177318.9099999999,12742905.34,16595524.480929166,3852619.1409291662,0.23214807976430174,{"$f":"SUM(K77:K98)","v":18104208.524650004}]
["Halls",null,0,0,0,0,0,null,0,""]
["Centres",null,3004835.8200000008,3918147.5470500006,3918147.5470500006,271332.84999999998,2937583.1899999995,{"$f":"E78/12*11","v":3591635.2514625005},654052.06146250106,0.18210425493406479,{"$f":"E78","v":3918147.5470500006}]
["Crèches",null,448705.92,548659.01474999997,548659.01474999997,38005.14,411926.79000000004,502937.43018750002,91010.640187499986,0.18095817635519854,548659.01474999997]
["Clinics/Care Centres",null,677388.93000000017,764478.64295000001,764478.64295000001,57374.52,621865.2300000001,700772.08937083336,78906.859370833263,0.1125998888478526,764478.64295000001]
["Fire/Ambulance Stations",null,501759.42,678885.78614999994,678885.78614999994,42498.759999999995,460631.63,622311.97063749994,161680.34063749993,0.25980593057188611,678885.78614999994]
["Testing Stations",null,0,null,0,0,0,null,0,""]
["Museums",null,0,null,0,0,0,null,0,""]
["Galleries",null,0,null,0,0,0,null,0,""]
["Theatres",null,167472.94,416635.26134999999,416635.26134999999,14184.86,153745.64000000001,{"$f":"E85/12*11","v":381915.65623750002},228170.01623750001,0.59743561833874925,{"$f":"E85","v":416635.26134999999}]
["Libraries",null,2223172.8800000004,3009039.9113500002,3009039.9113500002,189126.22,2043181.17,2758286.585404167,715105.41540416703,0.25925711243648158,3009039.9113500002]
["Cemeteries/Crematoria",null,320863.5,490039.86514999997,490039.86514999997,28147.15,305078.8,449203.20972083329,144124.4097208333,0.32084456789701576,490039.86514999997]
["Police",null,0,null,0,0,0,null,0,""]
["Purls",null,0,null,0,0,0,null,0,""]
["Public Open Space",null,80163.08,12373.635999999999,105470.77,6789.78,73592.329999999987,{"$f":"E90/12*11","v":96681.539166666669},23089.209166666682,0.23881714508975518,{"$f":"E90","v":105470.77}]
["Nature Reserves",null,0,null,0,0,0,0,0,"",0]
["Public Ablution Facilities",null,849761.71000000008,1136930.1757,1136930.1757,82234.61,883622.62,1042185.9943916667,158563.37439166673,0.15214498683051444,1136930.1757]
["Markets",null,4753384.1700000009,6310441.0401999988,6310441.0401999988,402609.05,4363762.5599999996,5784570.9535166658,1420808.3935166663,0.24562035887085135,6310441.0401999988]
["Stalls",null,0,null,0,0,0,null,0,""]
["Abattoirs",null,0,null,0,0,0,null,0,""]
["Airports",null,514432.17,1242828.2185,725480.51,45015.97,487915.37999999989,{"$f":"E96/12*11","v":665023.80083333328},177108.4208333334,0.26631892063321788,{"$f":"E96","v":725480.51}]
["Taxi Ranks/Bus Terminals",null,0,null,0,0,0,null,0,""]
["Capital Spares",null,0,null,0,0,0,null,0,""]
["Sport and Recreation Facilities",null,{"$f":"SUM(C100:C102)","v":13635311.205999933},14855353.675249998,14726692.529999997,901689.19,9773490.3299999982,13499468.152499996,3725977.8224999979,0.27600923091255086,{"$f":"SUM(K100:K102)","v":14726692.529999997}]
["Indoor Facilities",null,null,0,null,null,null,null,0,""]
["Outdoor Facilities",null,13635311.205999933,14855353.675249998,14726692.529999997,901689.19,9773490.3299999982,{"$f":"E101/12*11","v":13499468.152499996},{"$f":"H101-G101","v":3725977.8224999979},{"$f":"IF(I101=0,\"\",I101/H101)","v":0.27600923091255086},{"$f":"E101","v":14726692.529999997}]
["Capital Spares",null,null,0,null,null,null,null,0,""]
["Heritage assets",null,{"$f":"SUM(C104:C108)","v":0},0,0,0,0,0,0,"",{"$f":"SUM(K104:K108)","v":0}]
["Monuments",null,null,null,null,null,null,null,0,""]
["Historic Buildings",null,null,null,null,null,null,null,0,""]
["Works of Art",null,null,null,null,null,null,null,0,""]
["Conservation Areas",null,null,null,null,null,null,null,0,""]
["Other Heritage",null,null,null,null,null,null,null,0,""]
[null,null,null,null,null,null,null,null,0,""]
["Investment properties",null,{"$f":"+C111+C114","v":0},0,0,0,0,0,0,"",{"$f":"+K111+K114","v":0}]
["Revenue Generating",null,{"$f":"SUM(C112:C113)","v":0},0,0,0,0,0,0,"",{"$f":"SUM(K112:K113)","v":0}]
["Improved Property",null,null,null,null,null,null,null,0,""]
["Unimproved Property",null,null,null,null,null,null,null,0,""]
["Non-revenue Generating",null,{"$f":"SUM(C115:C116)","v":0},0,0,0,0,0,0,"",{"$f":"SUM(K115:K116)","v":0}]
["Improved Property",null,null,null,null,null,null,null,0,""]
["Unimproved Property",null,null,null,null,null,null,null,{"$f":"H116-G116","v":0},{"$f":"IF(I116=0,\"\",I116/H116)","v":""}]
["Other assets",null,{"$f":"+C118+C130","v":19473129.186000351},28585069.517949991,28654785.736800004,1677988.04,17739925.700000007,26266886.925400004,8526961.2253999971,0.32462778134375908,{"$f":"+K118+K130","v":28654785.736800004}]
["Operational Buildings",null,{"$f":"SUM(C119:C129)","v":19444178.686000351},28546344.514049992,28616060.732900005,1675535.95,17713348.190000005,26231389.005158339,8518040.8151583336,0.32472702126003627,{"$f":"SUM(K119:K129)","v":28616060.732900005}]
["Municipal Offices",null,18692562.186000351,27636906.491149992,27706622.710000005,1611874.53,17023339.700000007,{"$f":"E119/12*11","v":25397737.484166671},8374397.7841666639,0.32973007101075003,{"$f":"E119","v":27706622.710000005}]
["Pay/Enquiry Points",null,0,0,null,null,null,null,0,""]
["Building Plan Offices",null,0,0,null,null,null,null,0,""]
["Workshops",null,751616.5,909438.02289999987,909438.02289999987,63661.42,690008.49,{"$f":"E122/12*11","v":833651.52099166648},143643.03099166648,0.17230584647743047,{"$f":"E122","v":909438.02289999987}]
["Yards",null,null,null,null,null,null,null,0,""]
["Stores",null,null,null,null,null,null,null,0,""]
["Laboratories",null,null,null,null,null,null,null,0,""]
["Training Centres",null,null,null,null,null,null,null,0,""]
["Manufacturing Plant",null,null,null,null,null,null,null,0,""]
["Depots",null,null,null,null,null,null,null,0,""]
["Capital Spares",null,null,null,null,null,null,null,0,""]
["Housing",null,{"$f":"SUM(C131:C133)","v":28950.5},38725.003899999996,38725.003899999996,2452.09,26577.510000000006,35497.920241666667,8920.410241666661,0.25129388372437894,{"$f":"SUM(K131:K133)","v":38725.003899999996}]
["Staff Housing",null,28950.5,38725.003899999996,38725.003899999996,2452.09,26577.510000000006,{"$f":"E131/12*11","v":35497.920241666667},8920.410241666661,0.25129388372437894,{"$f":"E131","v":38725.003899999996}]
["Social Housing",null,null,null,null,null,null,null,0,""]
["Capital Spares",null,null,null,null,null,null,null,0,""]
[null,null,null,null,null,null,null,null,null,""]
["Biological or Cultivated Assets",null,{"$f":"SUM(C136:C136)","v":0},0,0,0,0,0,{"$f":"H135-G135","v":0},"",{"$f":"SUM(K136)","v":0}]
["Biological or Cultivated Assets",null,null,null,null,null,null,null,{"$f":"H136-G136","v":0},""]
[null,null,null,null,null,null,null,null,null,""]
["Intangible Assets",null,{"$f":"SUM(C139:C140)","v":8165360.5959999366},15992044.180199999,15992044.180199999,444525.83000000007,4818087.0199999977,14659373.831849998,{"$f":"H138-G138","v":9841286.8118500002},0.67133063968040163,{"$f":"SUM(K139:K140)","v":15992044.180199999}]
["Servitudes",null,null,15992044.180199999,null,null,null,{"$f":"E139/12*8","v":0},0,"",{"$f":"E139","v":0}]
["Licences and Rights",null,{"$f":"SUM(C141:C146)","v":8165360.5959999366},0,15992044.180199999,444525.83000000007,4818087.0199999977,14659373.831849998,9841286.8118500002,0.67133063968040163,{"$f":"SUM(K141:K146)","v":15992044.180199999}]
["Water Rights",null,null,null,null,null,null,null,0,""]
["Effluent Licenses",null,null,null,null,null,null,null,0,""]
["Solid Waste Licenses",null,null,null,null,null,null,null,0,""]
["Computer Software and Applications",null,8165360.5959999366,null,15992044.180199999,444525.83000000007,4818087.0199999977,{"$f":"E144/12*11","v":14659373.831849998},9841286.8118500002,0.67133063968040163,{"$f":"E144","v":15992044.180199999}]
["Load Settlement Software Applications",null,null,null,null,null,null,null,0,""]
["Unspecified",null,null,null,null,null,null,null,0,""]
[]
["Computer Equipment",null,{"$f":"SUM(C149:C149)","v":5523312.7699999977},11437628.752599997,11525706.310000002,799729.45999999973,7062249.6999999993,10565230.784166668,{"$f":"H148-G148","v":3502981.0841666684},{"$f":"IF(I148=0,\"\",I148/H148)","v":0.33155746009981418},{"$f":"SUM(K149)","v":11525706.310000002}]
["Computer Equipment",null,5523312.7699999977,11437628.752599997,11525706.310000002,799729.45999999973,7062249.6999999993,{"$f":"E149/12*11","v":10565230.784166668},{"$f":"H149-G149","v":3502981.0841666684},{"$f":"IF(I149=0,\"\",I149/H149)","v":0.33155746009981418},{"$f":"E149","v":11525706.310000002}]
[]
["Furniture and Office Equipment",null,{"$f":"SUM(C152:C152)","v":2031520.1000000003},1872477.8102999993,1877402.0400000003,204925.12000000005,2130852.709999999,1720951.87,{"$f":"H151-G151","v":-409900.83999999892},{"$f":"IF(I151=0,\"\",I151/H151)","v":-0.2381826285473044},{"$f":"SUM(K152)","v":1877402.0400000003}]
["Furniture and Office Equipment",null,2031520.1000000003,1872477.8102999993,1877402.0400000003,204925.12000000005,2130852.709999999,{"$f":"E152/12*11","v":1720951.87},{"$f":"H152-G152","v":-409900.83999999892},{"$f":"IF(I152=0,\"\",I152/H152)","v":-0.2381826285473044},{"$f":"E152","v":1877402.0400000003}]
[null,null,null,null,null,null,null,null,null,{"$f":"IF(I153=0,\"\",I153/H153)","v":""}]
["Machinery and Equipment",null,{"$f":"SUM(C155:C155)","v":6774736.8000000007},9685388.8983999956,10075541.029999997,763326.58000000007,7484031.4699999988,9235912.6108333319,{"$f":"H154-G154","v":1751881.1408333331},{"$f":"IF(I154=0,\"\",I154/H154)","v":0.18968143318922823},{"$f":"SUM(K155)","v":10075541.029999997}]
["Machinery and Equipment",null,6774736.8000000007,9685388.8983999956,10075541.029999997,763326.58000000007,7484031.4699999988,{"$f":"E155/12*11","v":9235912.6108333319},{"$f":"H155-G155","v":1751881.1408333331},{"$f":"IF(I155=0,\"\",I155/H155)","v":0.18968143318922823},{"$f":"E155","v":10075541.029999997}]
[]
["Transport Assets",null,{"$f":"SUM(C158:C158)","v":13361269.959999997},18390524.437050004,19224728.649999999,1363682.3900000006,13498114.08,17622667.929166667,{"$f":"H157-G157","v":4124553.8491666671},{"$f":"IF(I157=0,\"\",I157/H157)","v":0.23404820800942749},{"$f":"SUM(K158)","v":19224728.649999999}]
["Transport Assets",null,13361269.959999997,18390524.437050004,19224728.649999999,1363682.3900000006,13498114.08,{"$f":"E158/12*11","v":17622667.929166667},{"$f":"H158-G158","v":4124553.8491666671},{"$f":"IF(I158=0,\"\",I158/H158)","v":0.23404820800942749},{"$f":"E158","v":19224728.649999999}]
[]
["Land",null,{"$f":"SUM(C161:C161)","v":0},0,0,0,0,0,{"$f":"H160-G160","v":0},{"$f":"IF(I160=0,\"\",I160/H160)","v":""},{"$f":"SUM(K161)","v":0}]
["Land",null,null,null,null,null,null,null,{"$f":"H161-G161","v":0},{"$f":"IF(I161=0,\"\",I161/H161)","v":""}]
[]
["Zoo's, Marine and Non-biological Animals",null,{"$f":"SUM(C164:C164)","v":0},0,0,0,0,0,{"$f":"H163-G163","v":0},{"$f":"IF(I163=0,\"\",I163/H163)","v":""},{"$f":"SUM(K164)","v":0}]
["Zoo's, Marine and Non-biological Animals",null,null,null,null,null,null,null,{"$f":"H164-G164","v":0},{"$f":"IF(I164=0,\"\",I164/H164)","v":""}]
[null,null,null,null,null,null,null,null,null,{"$f":"IF(I165=0,\"\",I165/H165)","v":""}]
["Living resources",null,{"$f":"+C167+C170","v":0},0,0,0,0,0,{"$f":"H166-G166","v":0},"",{"$f":"+K167+K170","v":0}]
["Mature",null,{"$f":"+C168+C169","v":0},0,0,0,0,0,0,"",{"$f":"+K168+K169","v":0}]
["Policing and Protection",null,null,null,null,null,null,null,0,""]
["Zoological plants and animals",null,null,null,null,null,null,null,0,""]
["Immature",null,{"$f":"+C171+C172","v":0},0,0,0,0,0,0,"",{"$f":"+K171+K172","v":0}]
["Policing and Protection",null,null,null,null,null,null,null,0,""]
["Zoological plants and animals",null,null,null,null,null,null,null,0,""]
["Total Depreciation",1,{"$f":"C7+C75+C103+C110+C117+C135+C138+C148+C151+C154+C157+C160+C163+C166","v":350683902.00000012},461615974,462450136.63319999,31765602.540000007,335254486.77999991,422006592.79626667,{"$f":"H173-G173","v":86752106.016266763},{"$f":"IF(I173=0,\"\",I173/H173)","v":0.20557049936456401},{"$f":"K7+K75+K103+K110+K117+K135+K138+K148+K151+K154+K157+K160+K163+K166","v":462450136.63319999}]

{"sheet":"SC13e","index":33,"n_rows":176,"n_cols":11,"rows_kept":176,"cut":false,"hidden":false,"merged":[[0,0,0,10],[1,0,2,0],[1,1,2,1]]}
[{"$f":"muni& \" - \"&S71Se& \" - \"&Head57","v":"KZN225 Msunduzi - Supporting Table SC13e Monthly Budget Statement - capital expenditure on upgrading of existing assets by asset class - M11 May"}]
[{"$f":"desc","v":"Description"},{"$f":"head27","v":"Ref"},{"$f":"Head1","v":"2022/23"},{"$f":"Head2","v":"Budget Year 2023/24"}]
[null,null,{"$f":"Head5","v":"Audited Outcome"},{"$f":"Head6","v":"Original Budget"},{"$f":"Head7","v":"Adjusted Budget"},{"$f":"Head38","v":"Monthly actual"},{"$f":"Head39","v":"YearTD actual"},"YearTD budget",{"$f":"Head41","v":"YTD variance"},{"$f":"Head41","v":"YTD variance"},{"$f":"Head8","v":"Full Year Forecast"}]
["R thousands",1,null,null,null,null,null,null,null,"%"]
["Capital expenditure on upgrading of existing assets by Asset Class/Sub-class"]
[]
["Infrastructure",null,{"$f":"C8+C13+C17+C27+C38+C45+C53+C63+C69","v":228972136.79999989},189764500,295396765.13999999,16555136.32,199564409.09000003,270780368.04500002,{"$f":"H7-G7","v":71215958.954999983},{"$f":"IF(I7=0,\"\",I7/H7)","v":0.26300266695540075},{"$f":"K8+K13+K17+K27+K38+K45+K53+K63+K69","v":295396765.13999999}]
["Roads Infrastructure",null,{"$f":"SUM(C9:C12)","v":122865465.09999993},38400000,146358849.13999999,6121646.7400000002,107227753.39000002,134162278.37833332,26934524.9883333,0.20076078994707294,{"$f":"SUM(K9:K12)","v":146358849.13999999}]
["Roads",null,122865465.09999993,38400000,146358849.13999999,6121646.7400000002,107227753.39000002,{"$f":"E9/12*11","v":134162278.37833332},26934524.9883333,0.20076078994707294,{"$f":"E9","v":146358849.13999999}]
["Road Structures",null,null,null,null,null,null,null,0,""]
["Road Furniture",null,null,null,null,null,null,null,0,""]
["Capital Spares",null,null,null,null,null,null,null,0,""]
["Storm water Infrastructure",null,{"$f":"SUM(C14:C16)","v":0},0,0,0,0,0,0,"",{"$f":"SUM(K14:K16)","v":0}]
["Drainage Collection",null,null,null,null,null,null,null,0,""]
["Storm water Conveyance",null,null,null,null,null,null,null,0,""]
["Attenuation",null,null,null,null,null,null,null,0,""]
["Electrical Infrastructure",null,{"$f":"SUM(C18:C26)","v":5701590.3500000006},0,11618316,3295224.42,26655957.740000002,10650123,-16005834.740000002,-1.5028779235695213,{"$f":"SUM(K18:K26)","v":11618316}]
["Power Plants",null,5701590.3500000006,null,11618316,3295224.42,26655957.740000002,{"$f":"E18/12*11","v":10650123},-16005834.740000002,-1.5028779235695213,{"$f":"E18","v":11618316}]
["HV Substations",null,null,null,null,null,null,null,0,""]
["HV Switching Station",null,null,null,null,null,null,null,0,""]
["HV Transmission Conductors",null,null,null,null,null,null,null,0,""]
["MV Substations",null,null,null,null,null,null,null,0,""]
["MV Switching Stations",null,null,null,null,null,null,null,0,""]
["MV Networks",null,null,null,null,null,null,null,0,""]
["LV Networks",null,null,null,null,null,null,null,0,""]
["Capital Spares",null,null,null,null,null,null,null,0,""]
["Water Supply Infrastructure",null,{"$f":"SUM(C28:C37)","v":60283705.789999999},106064500,69619600,2425968.62,39252965.670000002,63817966.666666664,24565000.996666662,0.38492296573744378,{"$f":"SUM(K28:K37)","v":69619600}]
["Dams and Weirs",null,null,null,null,null,null,null,0,""]
["Boreholes",null,null,null,null,null,null,null,0,""]
["Reservoirs",null,null,null,null,null,null,null,0,""]
["Pump Stations",null,null,null,null,null,null,null,0,""]
["Water Treatment Works",null,null,null,null,null,null,null,0,""]
["Bulk Mains",null,null,null,null,null,null,null,0,""]
["Distribution",null,60283705.789999999,106064500,69619600,2425968.62,39252965.670000002,{"$f":"E34/12*11","v":63817966.666666664},24565000.996666662,0.38492296573744378,{"$f":"E34","v":69619600}]
["Distribution Points",null,null,null,null,null,null,null,0,""]
["PRV Stations",null,null,null,null,null,null,null,0,""]
["Capital Spares",null,null,null,null,null,null,null,0,""]
["Sanitation Infrastructure",null,{"$f":"SUM(C39:C44)","v":35610103.609999999},40300000,42800000,338003.01,12308113.799999999,39233333.333333328,26925219.533333331,0.68628427017841975,{"$f":"SUM(K39:K44)","v":42800000}]
["Pump Station",null,null,null,null,null,null,null,0,""]
["Reticulation",null,35610103.609999999,40300000,42800000,338003.01,12308113.799999999,{"$f":"E40/12*11","v":39233333.333333328},26925219.533333331,0.68628427017841975,{"$f":"E40","v":42800000}]
["Waste Water Treatment Works",null,null,null,null,null,null,null,0,""]
["Outfall Sewers",null,null,null,null,null,null,null,0,""]
["Toilet Facilities",null,null,null,null,null,null,null,0,""]
["Capital Spares",null,null,null,null,null,null,null,0,""]
["Solid Waste Infrastructure",null,{"$f":"SUM(C46:C52)","v":4511271.95},5000000,25000000,4374293.53,14119618.490000002,22916666.666666664,8797048.1766666621,0.38387119316363622,{"$f":"SUM(K46:K52)","v":25000000}]
["Landfill Sites",null,4511271.95,5000000,25000000,4374293.53,14119618.490000002,{"$f":"E46/12*11","v":22916666.666666664},8797048.1766666621,0.38387119316363622,{"$f":"E46","v":25000000}]
["Waste Transfer Stations",null,null,null,null,null,null,null,0,""]
["Waste Processing Facilities",null,null,null,null,null,null,null,0,""]
["Waste Drop-off Points",null,null,null,null,null,null,null,0,""]
["Waste Separation Facilities",null,null,null,null,null,null,null,0,""]
["Electricity Generation Facilities",null,null,null,null,null,null,null,0,""]
["Capital Spares",null,null,null,null,null,null,null,0,""]
["Rail Infrastructure",null,{"$f":"SUM(C54:C62)","v":0},0,0,0,0,0,0,"",{"$f":"SUM(K54:K62)","v":0}]
["Rail Lines",null,null,null,null,null,null,null,0,""]
["Rail Structures",null,null,null,null,null,null,null,0,""]
["Rail Furniture",null,null,null,null,null,null,null,0,""]
["Drainage Collection",null,null,null,null,null,null,null,0,""]
["Storm water Conveyance",null,null,null,null,null,null,null,0,""]
["Attenuation",null,null,null,null,null,null,null,0,""]
["MV Substations",null,null,null,null,null,null,null,0,""]
["LV Networks",null,null,null,null,null,null,null,0,""]
["Capital Spares",null,null,null,null,null,null,null,0,""]
["Coastal Infrastructure",null,{"$f":"SUM(C64:C68)","v":0},0,0,0,0,0,0,"",{"$f":"SUM(K64:K68)","v":0}]
["Sand Pumps",null,null,null,null,null,null,null,0,""]
["Piers",null,null,null,null,null,null,null,0,""]
["Revetments",null,null,null,null,null,null,null,0,""]
["Promenades",null,null,null,null,null,null,null,0,""]
["Capital Spares",null,null,null,null,null,null,null,0,""]
["Information and Communication Infrastructure",null,{"$f":"SUM(C70:C73)","v":0},0,0,0,0,0,0,"",{"$f":"SUM(K70:K73)","v":0}]
["Data Centres",null,null,null,null,null,null,null,0,""]
["Core Layers",null,null,null,null,null,null,null,0,""]
["Distribution Layers",null,null,null,null,null,null,null,0,""]
["Capital Spares",null,null,null,null,null,null,null,0,""]
[null,null,null,null,null,null,null,null,null,""]
["Community Assets",null,{"$f":"+C76+C99","v":0},0,8000000,0,1609988.75,7333333.333333333,5723344.583333333,0.78045607954545448,{"$f":"+K76+K99","v":8000000}]
["Community Facilities",null,{"$f":"SUM(C77:C98)","v":0},0,0,0,0,0,0,"",{"$f":"SUM(K77:K98)","v":0}]
["Halls",null,null,null,null,null,null,null,0,""]
["Centres",null,null,null,null,null,null,null,0,""]
["Crèches",null,null,null,null,null,null,null,0,""]
["Clinics/Care Centres",null,null,null,null,null,null,null,0,""]
["Fire/Ambulance Stations",null,null,null,null,null,null,null,0,""]
["Testing Stations",null,null,null,null,null,null,null,0,""]
["Museums",null,null,null,null,null,null,null,0,""]
["Galleries",null,null,null,null,null,null,null,0,""]
["Theatres",null,null,null,null,null,null,null,0,""]
["Libraries",null,null,null,null,null,null,null,0,""]
["Cemeteries/Crematoria",null,null,null,null,null,null,null,0,""]
["Police",null,null,null,null,null,null,null,0,""]
["Purls",null,null,null,null,null,null,null,0,""]
["Public Open Space",null,null,null,null,null,null,null,0,""]
["Nature Reserves",null,null,null,null,null,null,null,0,""]
["Public Ablution Facilities",null,null,null,null,null,null,null,0,""]
["Markets",null,null,null,null,null,null,null,0,""]
["Stalls",null,null,null,null,null,null,null,0,""]
["Abattoirs",null,null,null,null,null,null,null,0,""]
["Airports",null,null,null,null,null,null,null,0,""]
["Taxi Ranks/Bus Terminals",null,null,null,null,null,null,null,0,""]
["Capital Spares",null,null,null,null,null,null,null,0,""]
["Sport and Recreation Facilities",null,{"$f":"SUM(C100:C102)","v":0},0,8000000,0,1609988.75,7333333.333333333,5723344.583333333,0.78045607954545448,{"$f":"SUM(K100:K102)","v":8000000}]
["Indoor Facilities",null,null,null,null,null,null,null,0,""]
["Outdoor Facilities",null,null,null,8000000,null,1609988.75,{"$f":"E101/12*11","v":7333333.333333333},{"$f":"H101-G101","v":5723344.583333333},{"$f":"IF(I101=0,\"\",I101/H101)","v":0.78045607954545448},{"$f":"E101","v":8000000}]
["Capital Spares",null,null,null,null,null,null,null,0,""]
["Heritage assets",null,{"$f":"SUM(C104:C108)","v":0},0,0,0,0,0,0,"",{"$f":"SUM(K104:K108)","v":0}]
["Monuments",null,null,null,null,null,null,null,0,""]
["Historic Buildings",null,null,null,null,null,null,null,0,""]
["Works of Art",null,null,null,null,null,null,null,0,""]
["Conservation Areas",null,null,null,null,null,null,null,0,""]
["Other Heritage",null,null,null,null,null,null,null,0,""]
[null,null,null,null,null,null,null,null,0,""]
["Investment properties",null,{"$f":"+C111+C114","v":0},0,0,0,0,0,0,"",{"$f":"+K111+K114","v":0}]
["Revenue Generating",null,{"$f":"SUM(C112:C113)","v":0},0,0,0,0,0,0,"",{"$f":"SUM(K112:K113)","v":0}]
["Improved Property",null,null,null,null,null,null,null,0,""]
["Unimproved Property",null,null,null,null,null,null,null,0,""]
["Non-revenue Generating",null,{"$f":"SUM(C115:C116)","v":0},0,0,0,0,0,0,"",{"$f":"SUM(K115:K116)","v":0}]
["Improved Property",null,null,null,null,null,null,null,0,""]
["Unimproved Property",null,null,null,null,null,null,null,{"$f":"H116-G116","v":0},{"$f":"IF(I116=0,\"\",I116/H116)","v":""}]
["Other assets",null,{"$f":"+C118+C130","v":38160543.699999996},10700000,37111643.780000001,8116407.0700000003,23134890.52,34019006.798333339,10884116.27833334,0.31994221180103866,{"$f":"+K118+K130","v":37111643.780000001}]
["Operational Buildings",null,{"$f":"SUM(C119:C129)","v":38160543.699999996},10700000,37111643.780000001,8116407.0700000003,23134890.52,34019006.798333339,10884116.27833334,0.31994221180103866,{"$f":"SUM(K119:K129)","v":37111643.780000001}]
["Municipal Offices",null,38160543.699999996,10700000,37111643.780000001,8116407.0700000003,23134890.52,{"$f":"E119/12*11","v":34019006.798333339},10884116.27833334,0.31994221180103866,{"$f":"E119","v":37111643.780000001}]
["Pay/Enquiry Points",null,null,null,null,null,null,null,0,""]
["Building Plan Offices",null,null,null,null,null,null,null,0,""]
["Workshops",null,null,null,null,null,null,null,0,""]
["Yards",null,null,null,null,null,null,null,0,""]
["Stores",null,null,null,null,null,null,null,0,""]
["Laboratories",null,null,null,null,null,null,null,0,""]
["Training Centres",null,null,null,null,null,null,null,0,""]
["Manufacturing Plant",null,null,null,null,null,null,null,0,""]
["Depots",null,null,null,null,null,null,null,0,""]
["Capital Spares",null,null,null,null,null,null,null,0,""]
["Housing",null,{"$f":"SUM(C131:C133)","v":0},0,0,0,0,0,0,"",{"$f":"SUM(K131:K133)","v":0}]
["Staff Housing",null,null,null,null,null,null,null,0,""]
["Social Housing",null,null,null,null,null,null,null,0,""]
["Capital Spares",null,null,null,null,null,null,null,0,""]
[null,null,null,null,null,null,null,null,null,""]
["Biological or Cultivated Assets",null,{"$f":"SUM(C136:C136)","v":0},0,0,0,0,0,{"$f":"H135-G135","v":0},"",{"$f":"SUM(K136)","v":0}]
["Biological or Cultivated Assets",null,null,null,null,null,null,null,{"$f":"H136-G136","v":0},""]
[null,null,null,null,null,null,null,null,null,{"$f":"IF(I137=0,\"\",I137/H137)","v":""}]
["Intangible Assets",null,{"$f":"SUM(C139:C140)","v":0},0,0,0,0,0,{"$f":"H138-G138","v":0},"",{"$f":"SUM(K139:K140)","v":0}]
["Servitudes",null,null,null,null,null,null,null,0,""]
["Licences and Rights",null,{"$f":"SUM(C141:C146)","v":0},0,0,0,0,0,0,"",{"$f":"SUM(K141:K146)","v":0}]
["Water Rights",null,null,null,null,null,null,null,0,""]
["Effluent Licenses",null,null,null,null,null,null,null,0,""]
["Solid Waste Licenses",null,null,null,null,null,null,null,0,""]
["Computer Software and Applications",null,null,null,null,null,null,null,0,""]
["Load Settlement Software Applications",null,null,null,null,null,null,null,0,""]
["Unspecified",null,null,null,null,null,null,null,0,""]
[]
["Computer Equipment",null,{"$f":"SUM(C149:C149)","v":0},0,0,0,0,0,{"$f":"H148-G148","v":0},{"$f":"IF(I148=0,\"\",I148/H148)","v":""},{"$f":"SUM(K149)","v":0}]
["Computer Equipment",null,null,null,null,null,null,null,{"$f":"H149-G149","v":0},{"$f":"IF(I149=0,\"\",I149/H149)","v":""}]
[]
["Furniture and Office Equipment",null,{"$f":"SUM(C152:C152)","v":0},0,0,0,0,0,{"$f":"H151-G151","v":0},{"$f":"IF(I151=0,\"\",I151/H151)","v":""},{"$f":"SUM(K152)","v":0}]
["Furniture and Office Equipment",null,null,null,null,null,null,null,{"$f":"H152-G152","v":0},{"$f":"IF(I152=0,\"\",I152/H152)","v":""}]
[null,null,null,null,null,null,null,null,null,{"$f":"IF(I153=0,\"\",I153/H153)","v":""}]
["Machinery and Equipment",null,{"$f":"SUM(C155:C155)","v":0},0,0,0,0,0,{"$f":"H154-G154","v":0},{"$f":"IF(I154=0,\"\",I154/H154)","v":""},{"$f":"SUM(K155)","v":0}]
["Machinery and Equipment",null,null,null,null,null,null,null,{"$f":"H155-G155","v":0},{"$f":"IF(I155=0,\"\",I155/H155)","v":""}]
[]
["Transport Assets",null,{"$f":"SUM(C158:C158)","v":0},5000000,3300000,0,0,3025000,{"$f":"H157-G157","v":3025000},{"$f":"IF(I157=0,\"\",I157/H157)","v":1},{"$f":"SUM(K158)","v":3300000}]
["Transport Assets",null,null,5000000,3300000,null,null,{"$f":"E158/12*11","v":3025000},{"$f":"H158-G158","v":3025000},{"$f":"IF(I158=0,\"\",I158/H158)","v":1},{"$f":"E158","v":3300000}]
[]
["Land",null,{"$f":"SUM(C161:C161)","v":0},0,0,0,0,0,{"$f":"H160-G160","v":0},{"$f":"IF(I160=0,\"\",I160/H160)","v":""},{"$f":"SUM(K161)","v":0}]
["Land",null,null,null,null,null,null,null,{"$f":"H161-G161","v":0},{"$f":"IF(I161=0,\"\",I161/H161)","v":""}]
[null,null,null,null,null,null,null,null,null,"."]
["Zoo's, Marine and Non-biological Animals",null,{"$f":"SUM(C164:C164)","v":0},0,0,0,0,0,{"$f":"H163-G163","v":0},{"$f":"IF(I163=0,\"\",I163/H163)","v":""},{"$f":"SUM(K164)","v":0}]
["Zoo's, Marine and Non-biological Animals",null,null,null,null,null,null,null,{"$f":"H164-G164","v":0},""]
[null,null,null,null,null,null,null,null,null,""]
["Living resources",null,{"$f":"+C167+C170","v":0},0,0,0,0,0,{"$f":"H166-G166","v":0},"",{"$f":"+K167+K170","v":0}]
["Mature",null,{"$f":"+C168+C169","v":0},0,0,0,0,0,0,"",{"$f":"+K168+K169","v":0}]
["Policing and Protection",null,null,null,null,null,null,null,0,""]
["Zoological plants and animals",null,null,null,null,null,null,null,0,""]
["Immature",null,{"$f":"+C171+C172","v":0},{"$f":"+D171+D172","v":0},0,0,0,0,0,"",{"$f":"+K171+K172","v":0}]
["Policing and Protection",null,null,null,null,null,null,null,0,""]
["Zoological plants and animals",null,null,null,null,null,null,null,0,""]
["Total Capital Expenditure on upgrading of existing assets ",1,{"$f":"C7+C75+C103+C110+C117+C135+C138+C148+C151+C154+C157+C160+C163+C166","v":267132680.49999988},205464500,343808408.91999996,24671543.390000001,224309288.36000004,315157708.17666668,{"$f":"H173-G173","v":90848419.816666633},{"$f":"IF(I173=0,\"\",I173/H173)","v":0.28826335977078532},{"$f":"K7+K75+K103+K110+K117+K135+K138+K148+K151+K154+K157+K160+K163+K166","v":343808408.91999996}]
[]
[{"$f":"head27a","v":"References"}]
["1. Total Capital Expenditure on new assets (SC13a) plus Total Capital Expenditure on renewal of existing assets (SC13b) plus Total Capital Expenditure on upgrading of existing assets (SC13e)  must reconcile to total capital expenditure in Table C5"]

{"sheet":"SC71charts","index":34,"n_rows":104,"n_cols":10,"rows_kept":104,"cut":false,"hidden":false,"merged":[]}
[{"$f":"'Template names'!B102","v":"Chart C1 2023/24 Capital Expenditure Monthly Trend: actual v target"}]
["Month",{"$f":"'SC12'!B2","v":"2022/23"},{"$f":"'SC12'!C3","v":"Original Budget"},{"$f":"'SC12'!D3","v":"Adjusted Budget"},{"$f":"'SC12'!E3","v":"Monthly actual"}]
[{"$f":"LEFT('SC12'!A6,3)","v":"Jul"},{"$f":"'SC12'!B6","v":45649152.340833329},{"$f":"'SC12'!C6","v":64063337.833333336},{"$f":"'SC12'!D6","v":66878662.787499994},{"$f":"'SC12'!E6","v":16309726.66}]
[{"$f":"LEFT('SC12'!A7,3)","v":"Aug"},{"$f":"'SC12'!B7","v":45649152.340833329},{"$f":"'SC12'!C7","v":64063337.833333336},{"$f":"'SC12'!D7","v":66878662.787499994},{"$f":"'SC12'!E7","v":37529936.129999995}]
[{"$f":"LEFT('SC12'!A8,3)","v":"Sep"},{"$f":"'SC12'!B8","v":45649152.340833329},{"$f":"'SC12'!C8","v":64063337.833333336},{"$f":"'SC12'!D8","v":66878662.787499994},{"$f":"'SC12'!E8","v":51170632.060000002}]
[{"$f":"LEFT('SC12'!A9,3)","v":"Oct"},{"$f":"'SC12'!B9","v":45649152.340833329},{"$f":"'SC12'!C9","v":64063337.833333336},{"$f":"'SC12'!D9","v":66878662.787499994},{"$f":"'SC12'!E9","v":7816322.8100000005}]
[{"$f":"LEFT('SC12'!A10,3)","v":"Nov"},{"$f":"'SC12'!B10","v":45649152.340833329},{"$f":"'SC12'!C10","v":64063337.833333336},{"$f":"'SC12'!D10","v":66878662.787499994},{"$f":"'SC12'!E10","v":79015351.729999989}]
[{"$f":"LEFT('SC12'!A11,3)","v":"Dec"},{"$f":"'SC12'!B11","v":45649152.340833329},{"$f":"'SC12'!C11","v":64063337.833333336},{"$f":"'SC12'!D11","v":66878662.787499994},{"$f":"'SC12'!E11","v":73006446.530000001}]
[{"$f":"LEFT('SC12'!A12,3)","v":"Jan"},{"$f":"'SC12'!B12","v":45649152.340833329},{"$f":"'SC12'!C12","v":64063337.833333336},{"$f":"'SC12'!D12","v":66878662.787499994},{"$f":"'SC12'!E12","v":12141450.92}]
[{"$f":"LEFT('SC12'!A13,3)","v":"Feb"},{"$f":"'SC12'!B13","v":45649152.340833329},{"$f":"'SC12'!C13","v":64063337.833333336},{"$f":"'SC12'!D13","v":66878662.787499994},{"$f":"'SC12'!E13","v":19214834.099999998}]
[{"$f":"LEFT('SC12'!A14,3)","v":"Mar"},{"$f":"'SC12'!B14","v":45649152.340833329},{"$f":"'SC12'!C14","v":64063337.833333336},{"$f":"'SC12'!D14","v":66878662.787499994},{"$f":"'SC12'!E14","v":116596464.84}]
[{"$f":"LEFT('SC12'!A15,3)","v":"Apr"},{"$f":"'SC12'!B15","v":45649152.340833329},{"$f":"'SC12'!C15","v":64063337.833333336},{"$f":"'SC12'!D15","v":66878662.787499994},{"$f":"'SC12'!E15","v":34296575.730000004}]
[{"$f":"LEFT('SC12'!A16,3)","v":"May"},{"$f":"'SC12'!B16","v":45649152.340833329},{"$f":"'SC12'!C16","v":64063337.833333336},{"$f":"'SC12'!D16","v":66878662.787499994},{"$f":"'SC12'!E16","v":66307801.810000002}]
[{"$f":"LEFT('SC12'!A17,3)","v":"Jun"},{"$f":"'SC12'!B17","v":45649152.340833329},{"$f":"'SC12'!C17","v":64063337.833333336},{"$f":"'SC12'!D17","v":66878662.787499994},{"$f":"'SC12'!E17","v":0}]
[]
[]
[]
[]
[]
[]
[]
[]
[]
[]
[]
[{"$f":"'Template names'!B103","v":"Chart C2 2023/24 Capital Expenditure: YTD actual v YTD target"}]
["Month",{"$f":"'SC12'!F3","v":"YearTD actual"},{"$f":"'SC12'!G3","v":"YearTD budget"}]
[{"$f":"LEFT('SC12'!A6,3)","v":"Jul"},{"$f":"'SC12'!F6","v":16309726.66},{"$f":"'SC12'!G6","v":66878662.787499994}]
[{"$f":"LEFT('SC12'!A7,3)","v":"Aug"},{"$f":"'SC12'!F7","v":53839662.789999992},{"$f":"'SC12'!G7","v":133757325.57499999}]
[{"$f":"LEFT('SC12'!A8,3)","v":"Sep"},{"$f":"'SC12'!F8","v":105010294.84999999},{"$f":"'SC12'!G8","v":200635988.36249998}]
[{"$f":"LEFT('SC12'!A9,3)","v":"Oct"},{"$f":"'SC12'!F9","v":112826617.66},{"$f":"'SC12'!G9","v":267514651.14999998}]
[{"$f":"LEFT('SC12'!A10,3)","v":"Nov"},{"$f":"'SC12'!F10","v":191841969.38999999},{"$f":"'SC12'!G10","v":334393313.9375}]
[{"$f":"LEFT('SC12'!A11,3)","v":"Dec"},{"$f":"'SC12'!F11","v":264848415.91999999},{"$f":"'SC12'!G11","v":401271976.72500002}]
[{"$f":"LEFT('SC12'!A12,3)","v":"Jan"},{"$f":"'SC12'!F12","v":276989866.83999997},{"$f":"'SC12'!G12","v":468150639.51250005}]
[{"$f":"LEFT('SC12'!A13,3)","v":"Feb"},{"$f":"'SC12'!F13","v":296204700.94},{"$f":"'SC12'!G13","v":535029302.30000007}]
[{"$f":"LEFT('SC12'!A14,3)","v":"Mar"},{"$f":"'SC12'!F14","v":412801165.77999997},{"$f":"'SC12'!G14","v":601907965.0875001}]
[{"$f":"LEFT('SC12'!A15,3)","v":"Apr"},{"$f":"'SC12'!F15","v":447097741.50999999},{"$f":"'SC12'!G15","v":668786627.87500012}]
[{"$f":"LEFT('SC12'!A16,3)","v":"May"},{"$f":"'SC12'!F16","v":513405543.31999999},{"$f":"'SC12'!G16","v":735665290.66250014}]
[{"$f":"LEFT('SC12'!A17,3)","v":"Jun"},{"$f":"'SC12'!F17","v":""},{"$f":"'SC12'!G17","v":802543953.45000017}]
[]
[]
[]
[]
[]
[]
[]
[]
[]
[]
[]
[{"$f":"'Template names'!B104","v":"Chart C3 Aged Consumer Debtors Analysis"}]
[null,{"$f":"'SC3'!C3","v":"0-30 Days"},{"$f":"'SC3'!D3","v":"31-60 Days"},{"$f":"'SC3'!E3","v":"61-90 Days"},{"$f":"'SC3'!F3","v":"91-120 Days"},{"$f":"'SC3'!G3","v":"121-150 Dys"},{"$f":"'SC3'!H3","v":"151-180 Dys"},{"$f":"'SC3'!I3","v":"181 Dys-1 Yr"},{"$f":"'SC3'!J3","v":"Over 1Yr"}]
[{"$f":"Head2","v":"Budget Year 2023/24"},{"$f":"'SC3'!C14","v":491289982.10000002},{"$f":"'SC3'!D14","v":138617529.86000001},{"$f":"'SC3'!E14","v":147824298.43000001},{"$f":"'SC3'!F14","v":142665023.90000001},{"$f":"'SC3'!G14","v":134407579.11000001},{"$f":"'SC3'!H14","v":126324045.57000001},{"$f":"'SC3'!I14","v":716122038.13000011},{"$f":"'SC3'!J14","v":5121379629.79}]
[{"$f":"Head1","v":"2022/23"},{"$f":"'SC3'!C15","v":494939284.85000002},{"$f":"'SC3'!D15","v":120252017.13999999},{"$f":"'SC3'!E15","v":123613075.31},{"$f":"'SC3'!F15","v":103046643.31999999},{"$f":"'SC3'!G15","v":107754208.46999997},{"$f":"'SC3'!H15","v":111014020.16},{"$f":"'SC3'!I15","v":688016753.56000006},{"$f":"'SC3'!J15","v":4214989341.5500002}]
[]
[]
[]
[]
[]
[]
[]
[]
[]
[]
[]
[]
[]
[]
[]
[]
[]
[]
[]
[]
[]
[{"$f":"'Template names'!B105","v":"Chart C4 Consumer Debtors (total by Debtor Customer Category)"}]
[null,{"$f":"Head1","v":"2022/23"},{"$f":"Head2","v":"Budget Year 2023/24"}]
[{"$f":"'SC3'!A17","v":"Organs of State"},{"$f":"C78*0.97","v":211916375.9305},{"$f":"'SC3'!K17","v":218470490.65000001}]
[{"$f":"'SC3'!A18","v":"Commercial"},{"$f":"C79*0.97","v":1079914254.3030999},{"$f":"'SC3'!K18","v":1113313664.23}]
[{"$f":"'SC3'!A19","v":"Households"},{"$f":"C80*0.97","v":5516240592.8497},{"$f":"'SC3'!K19","v":5686845972.0100002}]
[{"$f":"'SC3'!A20","v":"Other"},{"$f":"C81*0.97","v":0},{"$f":"'SC3'!K20","v":0}]
[]
[]
[]
[]
[]
[]
[]
[]
[]
[]
[]
[]
[]
[]
[]
[]
[]
[]
[]
[{"$f":"'Template names'!B106","v":"Chart C5 Aged Creditors Analysis"}]
[null,{"$f":"'SC4'!A6","v":"Bulk Electricity"},{"$f":"'SC4'!A7","v":"Bulk Water"},{"$f":"'SC4'!A8","v":"PAYE deductions"},{"$f":"'SC4'!A9","v":"VAT (output less input)"},{"$f":"'SC4'!A10","v":"Pensions / Retirement deductions"},{"$f":"'SC4'!A11","v":"Loan repayments"},{"$f":"'SC4'!A12","v":"Trade Creditors"},{"$f":"'SC4'!A13","v":"Auditor General"},{"$f":"'SC4'!A14","v":"Other"}]
[{"$f":"A54","v":"2022/23"},{"$f":"'SC4'!L6","v":650213111.24000001},{"$f":"'SC4'!L7","v":643652270.55999994},{"$f":"'SC4'!L8","v":0},{"$f":"'SC4'!L9","v":0},{"$f":"'SC4'!L10","v":0},{"$f":"'SC4'!L11","v":0},{"$f":"'SC4'!L12","v":0},{"$f":"'SC4'!L13","v":0},{"$f":"'SC4'!L14","v":69842286.349999994}]
[{"$f":"A53","v":"Budget Year 2023/24"},{"$f":"'SC4'!K6","v":1367148822.6300001},{"$f":"'SC4'!K7","v":620948012.98000002},{"$f":"'SC4'!K8","v":0},{"$f":"'SC4'!K9","v":0},{"$f":"'SC4'!K10","v":0},{"$f":"'SC4'!K11","v":0},{"$f":"'SC4'!K12","v":0},{"$f":"'SC4'!K13","v":0},{"$f":"'SC4'!K14","v":138299808.35999998}]